{"text_format":"1","workbook":"xlsx","n_sheets":15,"sheets":["INPUT","Athletes","U11 Tri","U13B Tri","U13G Tri","U15B Pent","U15G Pent","U17W Pent","U17M Pent","Scoring Tables","AAA Grades","Lists","U13G choices","U13B choices","Sheet1"],"not_rendered":{"charts":0,"images":1,"macros":1,"external_links":0,"defined_names":96,"comments":1,"pivot_tables":0},"unopened":[],"bounds":{"document_bytes":16777216,"sheet_cells":100000,"rows_first":2000,"rows_last":500,"rows_between":2000,"halvings":0,"cell_chars":16384,"cell_head_chars":4096},"cells_cut":0,"cells_raw":0,"read":"whole","date_system":"1900"}

{"sheet":"INPUT","index":0,"n_rows":34,"n_cols":2,"rows_kept":34,"cut":false,"hidden":false,"merged":[]}
["General Input to all Scoring Tables"]
[]
["Event Title","CHESHIRE COUNTY ATHLETICS ASSOCIATION - Junior Multievent Championship, Macclesfield"]
["Arranged By:","Handforth W A A C"]
["Sponsored By:","Jones Homes"]
["Date:","2015-09-13"]
["Scorer:","H Branthwaite"]
["Clubs Entered"]
[]
[null,"Team Number"]
["Altrincham & District",{"$f":"ROW(11:11)-ROW($10:$10)","v":1}]
["Colwyn Bay",2]
["Crewe & Nantwich",3]
["Deeside AC",4]
["East Cheshire H",5]
["Halton & Frodsham",6]
["Handforth WAAC",7]
["Leigh H",8]
["Macclesfield H",9]
["Manchester H",10]
["Sale H",11]
["Salford Mets",12]
["Southport Waterloo",13]
["St. Helens Sutton",14]
["Stockport H",15]
["Trafford ",16]
["Vale Royal",17]
["Warrington",18]
["West Cheshire",19]
["Wirral AC",20]
["Wrexham",21]
[null,22]
[null,23]
["Club names in shaded area only & sorted in alphabetical order"]

{"sheet":"Athletes","index":1,"n_rows":124,"n_cols":17,"rows_kept":124,"cut":false,"hidden":false,"merged":[]}
["No.","Name","M\nF","Club","Age","Cheshire",null,"Hurdles","Sprint","800m","LJ","HJ","Shot","Jav",null,"AName","Notes"]
[null,"Verbickas, Ben","M","Crewe & Nantwich","U13","C",null,null,null,null,null,null,null,null,null,{"$f":"CONCATENATE(RIGHT(B2,LEN(B2)-FIND(\" \",B2)),\", \",LEFT(B2, FIND(\" \",B2)) )","v":"Ben, Verbickas, "}]
[null,"Cathery, Joseph","M","Handforth WAAC","U13","C",null,null,null,null,null,null,null,null,null,"Joseph, Cathery, "]
[null,"Horne, Brandon","M","Handforth WAAC","U13","C",null,null,null,null,null,null,null,null,null,"Brandon, Horne, "]
[null,"Danson, Sam","M","Macclesfield H","U13","C",null,null,null,null,null,null,null,null,null,"Sam, Danson, "]
[null,"Frith, Morgan","M","Macclesfield H","U13","C",null,null,null,null,null,null,null,null,null,"Morgan, Frith, "]
[null,"Roberts, Thomas","M","Macclesfield H","U13","C",null,null,null,null,null,null,null,null,null,"Thomas, Roberts, "]
[null,"Thompson, Jacob","M","Macclesfield H","U13","C",null,null,null,null,null,null,null,null,null,"Jacob, Thompson, "]
[null,"Cooper, Matthew","M","Manchester H","U13",null,null,null,null,null,null,null,null,null,null,"Matthew, Cooper, "]
[null,"Hopkins, Jamie","M","Southport Waterloo","U13",null,null,null,null,null,null,null,null,null,null,"Jamie, Hopkins, "]
[null,"Culmer, William","M","Stockport H","U13","C",null,null,null,null,null,null,null,null,null,"William, Culmer, "]
[null,"Houlden, Matthew","M","Stockport H","U13","C",null,null,null,null,null,null,null,null,null,"Matthew, Houlden, "]
[null,"Shaw, Adam","M","Warrington","U13","C",null,null,null,null,null,null,null,null,null,"Adam, Shaw, "]
[null,"Bugg, Dylan","M","West Cheshire","U13","C",null,null,null,null,null,null,null,null,null,"Dylan, Bugg, "]
[null,"Howe, Adam","M","West Cheshire","U13","C",null,null,null,null,null,null,null,null,null,"Adam, Howe, "]
[null,"Smith, Ivor","M","West Cheshire","U13","C",null,null,null,null,null,null,null,null,null,"Ivor, Smith, "]
[null,"Townend, Louis","M",null,"U13","C",null,null,null,null,null,null,null,null,null,"Louis, Townend, "]
["No.","Name","M\nF","Club","Age","Cheshire",null,"Hurdles","Sprint","800m","LJ","HJ","Shot","Jav",null,{"$error":"#VALUE!"}]
[null,"Simpson, Emma","F","Altrincham & District","U13",null,null,null,null,null,null,null,null,null,null,"Emma, Simpson, "]
[null,"Fowler, Olivia","F","Crewe & Nantwich","U13","C",null,null,null,null,null,null,null,null,null,"Olivia, Fowler, "]
[null,"Lewis, Megan","F","East Cheshire H","U13",null,null,null,null,null,null,null,null,null,null,"Megan, Lewis, "]
[null,"Cathery, Isabel","F","Handforth WAAC","U13","C",null,null,null,null,null,null,null,null,null,"Isabel, Cathery, "]
[null,"Merry, Immy","F","Handforth WAAC","U13","C",null,null,null,null,null,null,null,null,null,"Immy, Merry, "]
[null,"Sheekey, Freya","F","Handforth WAAC","U13","C",null,null,null,null,null,null,null,null,null,"Freya, Sheekey, "]
[null,"Carey, Liliana","F","Macclesfield H","U13","C",null,null,null,null,null,null,null,null,null,"Liliana, Carey, "]
[null,"Dutton, Poppy","F","Macclesfield H","U13","C",null,null,null,null,null,null,null,null,null,"Poppy, Dutton, "]
[null,"Greeney, Libby","F","Macclesfield H","U13","C",null,null,null,null,null,null,null,null,null,"Libby, Greeney, "]
[null,"Heslop, Sian","F","Macclesfield H","U13","C",null,null,null,null,null,null,null,null,null,"Sian, Heslop, "]
[null,"Dale, Alice","F","Sale H","U13",null,null,null,null,null,null,null,null,null,null,"Alice, Dale, "]
[null,"Whittaker, Scarlett","F","Sale H","U13","C",null,null,null,null,null,null,null,null,null,"Scarlett, Whittaker, "]
[null,"Burgess, Lauren","F","Stockport H","U13",null,null,null,null,null,null,null,null,null,null,"Lauren, Burgess, "]
[null,"Martin, Millie","F","Stockport H","U13",null,null,null,null,null,null,null,null,null,null,"Millie, Martin, "]
[null,"Wild, Evie","F","Stockport H","U13",null,null,null,null,null,null,null,null,null,null,"Evie, Wild, "]
[null,"Cartwright, Abigail","F","West Cheshire","U13","C",null,null,null,null,null,null,null,null,null,{"$f":"CONCATENATE(RIGHT(B34,LEN(B34)-FIND(\" \",B34)),\", \",LEFT(B34, FIND(\" \",B34)) )","v":"Abigail, Cartwright, "}]
[null,"Crayston, Anna","F","West Cheshire","U13","C",null,null,null,null,null,null,null,null,null,"Anna, Crayston, "]
[null,"Hall, Jessica","F","West Cheshire","U13","C",null,null,null,null,null,null,null,null,null,"Jessica, Hall, "]
[null,"Jayaram, Mimi","F","West Cheshire","U13","C",null,null,null,null,null,null,null,null,null,"Mimi, Jayaram, "]
[null,"Jones, Lauren Eve","F","West Cheshire","U13","C",null,null,null,null,null,null,null,null,null,"Lauren Eve, Jones, "]
[null,"Misantoni, Emily","F","West Cheshire","U13","C",null,null,null,null,null,null,null,null,null,"Emily, Misantoni, "]
[null,"Pawlett, Abigail","F","West Cheshire","U13","C",null,null,null,null,null,null,null,null,null,"Abigail, Pawlett, "]
[null,"Tipping, Evie","F","West Cheshire","U13","C",null,null,null,null,null,null,null,null,null,"Evie, Tipping, "]
[null,null,null,null,null,null,null,null,null,null,null,null,null,null,null,{"$error":"#VALUE!"}]
[null,null,null,null,null,null,null,null,null,null,null,null,null,null,null,{"$error":"#VALUE!"}]
[null,null,null,null,null,null,null,null,null,null,null,null,null,null,null,{"$error":"#VALUE!"}]
[null,null,null,null,null,null,null,null,null,null,null,null,null,null,null,{"$error":"#VALUE!"}]
[null,null,null,null,null,null,null,null,null,null,null,null,null,null,null,{"$error":"#VALUE!"}]
[null,null,null,null,null,null,null,null,null,null,null,null,null,null,null,{"$error":"#VALUE!"}]
[null,null,null,null,null,null,null,null,null,null,null,null,null,null,null,{"$error":"#VALUE!"}]
[null,null,null,null,null,null,null,null,null,null,null,null,null,null,null,{"$error":"#VALUE!"}]
[null,null,null,null,null,null,null,null,null,null,null,null,null,null,null,{"$error":"#VALUE!"}]
[null,null,null,null,null,null,null,null,null,null,null,null,null,null,null,{"$error":"#VALUE!"}]
[null,null,null,null,null,"C",null,null,null,null,null,null,null,null,null,{"$error":"#VALUE!"}]
[null,null,null,null,null,"C",null,null,null,null,null,null,null,null,null,{"$error":"#VALUE!"}]
[null,null,null,null,null,"C",null,null,null,null,null,null,null,null,null,{"$error":"#VALUE!"}]
[null,null,null,null,null,"C",null,null,null,null,null,null,null,null,null,{"$error":"#VALUE!"}]
[null,null,null,null,null,"C",null,null,null,null,null,null,null,null,null,{"$error":"#VALUE!"}]
[null,null,null,null,null,"C",null,null,null,null,null,null,null,null,null,{"$error":"#VALUE!"}]
[null,null,null,null,null,null,null,null,null,null,null,null,null,null,null,{"$error":"#VALUE!"}]
[null,null,null,null,null,null,null,null,null,null,null,null,null,null,null,{"$error":"#VALUE!"}]
[null,null,null,null,null,null,null,null,null,null,null,null,null,null,null,{"$error":"#VALUE!"}]
[null,null,null,null,null,"C",null,null,null,null,null,null,null,null,null,{"$error":"#VALUE!"}]
[null,null,null,null,null,"C",null,null,null,null,null,null,null,null,null,{"$error":"#VALUE!"}]
[null,null,null,null,null,"C",null,null,null,null,null,null,null,null,null,{"$error":"#VALUE!"}]
[null,null,null,null,null,"C",null,null,null,null,null,null,null,null,null,{"$error":"#VALUE!"}]
[null,null,null,null,null,"C",null,null,null,null,null,null,null,null,null,{"$error":"#VALUE!"}]
[null,null,null,null,null,"C",null,null,null,null,null,null,null,null,null,{"$f":"CONCATENATE(RIGHT(B66,LEN(B66)-FIND(\" \",B66)),\", \",LEFT(B66, FIND(\" \",B66)) )","v":{"$error":"#VALUE!"}}]
[null,null,null,null,null,"C",null,null,null,null,null,null,null,null,null,{"$error":"#VALUE!"}]
[null,null,null,null,null,null,null,null,null,null,null,null,null,null,null,{"$error":"#VALUE!"}]
[null,null,null,null,null,"C",null,null,null,null,null,null,null,null,null,{"$error":"#VALUE!"}]
[null,null,null,null,null,"C",null,null,null,null,null,null,null,null,null,{"$error":"#VALUE!"}]
[null,null,null,null,null,"C",null,null,null,null,null,null,null,null,null,{"$error":"#VALUE!"}]
[null,null,null,null,null,"C",null,null,null,null,null,null,null,null,null,{"$error":"#VALUE!"}]
[null,null,null,null,null,null,null,null,null,null,null,null,null,null,null,{"$error":"#VALUE!"}]
[null,null,null,null,null,"C",null,null,null,null,null,null,null,null,null,{"$error":"#VALUE!"}]
[null,null,null,null,null,"C",null,null,null,null,null,null,null,null,null,{"$error":"#VALUE!"}]
[null,null,null,null,null,"C",null,null,null,null,null,null,null,null,null,{"$error":"#VALUE!"}]
[null,null,null,null,null,"C",null,null,null,null,null,null,null,null,null,{"$error":"#VALUE!"}]
[null,null,null,null,null,"C",null,null,null,null,null,null,null,null,null,{"$error":"#VALUE!"}]
[null,null,null,null,null,"C",null,null,null,null,null,null,null,null,null,{"$error":"#VALUE!"}]
[null,null,null,null,null,"C",null,null,null,null,null,null,null,null,null,{"$error":"#VALUE!"}]
[null,null,null,null,null,null,null,null,null,null,null,null,null,null,null,{"$error":"#VALUE!"}]
[null,null,null,null,null,"C",null,null,null,null,null,null,null,null,null,{"$error":"#VALUE!"}]
[null,null,null,null,null,"C",null,null,null,null,null,null,null,null,null,{"$error":"#VALUE!"}]
[null,null,null,null,null,"C",null,null,null,null,null,null,null,null,null,{"$error":"#VALUE!"}]
[null,null,null,null,null,"C",null,null,null,null,null,null,null,null,null,{"$error":"#VALUE!"}]
[null,null,null,null,null,null,null,null,null,null,null,null,null,null,null,{"$error":"#VALUE!"}]
[null,null,null,null,null,"C",null,null,null,null,null,null,null,null,null,{"$error":"#VALUE!"}]
[null,null,null,null,null,"C",null,null,null,null,null,null,null,null,null,{"$error":"#VALUE!"}]
[null,null,null,null,null,null,null,null,null,null,null,null,null,null,null,{"$error":"#VALUE!"}]
[null,null,null,null,null,null,null,null,null,null,null,null,null,null,null,{"$error":"#VALUE!"}]
[null,null,null,null,null,"C",null,null,null,null,null,null,null,null,null,{"$error":"#VALUE!"}]
[null,null,null,null,null,null,null,null,null,null,null,null,null,null,null,{"$error":"#VALUE!"}]
[null,null,null,null,null,null,null,null,null,null,null,null,null,null,null,{"$error":"#VALUE!"}]
[null,null,null,null,"U15","C",null,null,null,null,null,null,null,null,null,{"$error":"#VALUE!"}]
[null,null,null,null,"U15","C",null,null,null,null,null,null,null,null,null,{"$error":"#VALUE!"}]
[null,null,null,null,"U15","C",null,null,null,null,null,null,null,null,null,{"$error":"#VALUE!"}]
[null,null,null,null,"U15","C",null,null,null,null,null,null,null,null,null,{"$error":"#VALUE!"}]
[null,null,null,null,"U15","C",null,null,null,null,null,null,null,null,null,{"$f":"CONCATENATE(RIGHT(B98,LEN(B98)-FIND(\" \",B98)),\", \",LEFT(B98, FIND(\" \",B98)) )","v":{"$error":"#VALUE!"}}]
[null,null,null,null,"U15","C",null,null,null,null,null,null,null,null,null,{"$error":"#VALUE!"}]
[null,null,null,null,"U15",null,null,null,null,null,null,null,null,null,null,{"$error":"#VALUE!"}]
[null,null,null,null,"U15",null,null,null,null,null,null,null,null,null,null,{"$error":"#VALUE!"}]
[null,null,null,null,"U15","C",null,null,null,null,null,null,null,null,null,{"$error":"#VALUE!"}]
[null,null,null,null,"U17","C",null,null,null,null,null,null,null,null,null,{"$error":"#VALUE!"}]
[null,null,null,null,"U17","C",null,null,null,null,null,null,null,null,null,{"$error":"#VALUE!"}]
[]
[]
[null,null,null,null,"U17","C",null,null,null,null,null,null,null,null,null,{"$error":"#VALUE!"}]
[null,null,null,null,"U17","C",null,null,null,null,null,null,null,null,null,{"$error":"#VALUE!"}]
[null,null,null,null,"U17",null,null,null,null,null,null,null,null,null,null,{"$error":"#VALUE!"}]
[null,null,null,null,null,null,null,null,null,null,null,null,null,null,null,{"$error":"#VALUE!"}]
[null,null,null,null,null,null,null,null,null,null,null,null,null,null,null,{"$error":"#VALUE!"}]
[null,null,null,null,null,null,null,null,null,null,null,null,null,null,null,{"$error":"#VALUE!"}]
[null,null,null,null,null,null,null,null,null,null,null,null,null,null,null,{"$error":"#VALUE!"}]
[null,null,null,null,null,null,null,null,null,null,null,null,null,null,null,{"$error":"#VALUE!"}]
[null,null,null,null,null,null,null,null,null,null,null,null,null,null,null,{"$error":"#VALUE!"}]
[null,null,null,null,null,null,null,null,null,null,null,null,null,null,null,{"$error":"#VALUE!"}]
[null,null,null,null,null,null,null,null,null,null,null,null,null,null,null,{"$error":"#VALUE!"}]
[null,null,null,null,null,null,null,null,null,null,null,null,null,null,null,{"$error":"#VALUE!"}]
[null,null,null,null,null,null,null,null,null,null,null,null,null,null,null,{"$error":"#VALUE!"}]
[null,null,null,null,null,null,null,null,null,null,null,null,null,null,null,{"$error":"#VALUE!"}]
[null,null,null,null,null,null,null,null,null,null,null,null,null,null,null,{"$error":"#VALUE!"}]
[null,null,null,null,null,null,null,null,null,null,null,null,null,null,null,{"$error":"#VALUE!"}]
[null,null,null,null,null,null,null,null,null,null,null,null,null,null,null,{"$error":"#VALUE!"}]
[null,null,null,null,null,null,null,null,null,null,null,null,null,null,null,{"$error":"#VALUE!"}]

{"sheet":"U11 Tri","index":2,"n_rows":117,"n_cols":101,"rows_kept":117,"cut":false,"hidden":false,"merged":[[0,94,5,94],[0,95,5,95],[0,96,5,96],[0,88,5,88],[0,89,5,89],[0,90,5,90],[0,91,5,91],[0,92,5,92],[0,93,5,93],[0,87,5,87],[0,76,5,76],[0,77,5,77],[0,78,5,78],[0,79,5,79],[0,80,5,80],[0,81,5,81],[0,82,5,82],[0,83,5,83],[0,84,5,84],[0,85,5,85],[0,86,5,86],[0,75,5,75],[0,71,5,71],[0,72,5,72],[0,73,5,73],[0,74,5,74],[0,67,5,67],[0,68,5,68],[0,69,5,69],[0,70,5,70],[0,63,5,63],[0,64,5,64],[0,65,5,65],[0,66,5,66],[0,61,5,61],[0,62,5,62],[0,55,5,55],[0,56,5,56],[0,57,5,57],[0,58,5,58],[0,59,5,59],[0,60,5,60],[0,53,5,53],[0,46,5,46],[0,47,5,47],[0,54,5,54],[0,48,5,48],[0,49,5,49],[0,50,5,50],[0,51,5,51],[0,52,5,52],[0,45,5,45],[0,38,5,38],[0,39,5,39],[0,34,5,34],[0,35,5,35],[0,36,5,36],[0,40,5,40],[0,41,5,41],[0,42,5,42],[0,43,5,43],[4,6,4,8],[0,37,5,37],[3,13,3,15],[3,6,3,8],[0,44,5,44],[0,0,0,18],[1,5,1,9]]}
[{"$f":"EventTitle","v":"CHESHIRE COUNTY ATHLETICS ASSOCIATION - Junior Multievent Championship, Macclesfield"},null,null,null,null,null,null,null,null,null,null,null,null,null,null,null,null,null,null,null,null,null,null,null,null,null,null,null,null,null,null,null,null,null,{"$f":"INDEX(Clubs,1,1)","v":"Altrincham & District"},{"$f":"INDEX(Clubs,2,1)","v":"Colwyn Bay"},{"$f":"INDEX(Clubs,3,1)","v":"Crewe & Nantwich"},{"$f":"INDEX(Clubs,4,1)","v":"Deeside AC"},{"$f":"INDEX(Clubs,5,1)","v":"East Cheshire H"},{"$f":"INDEX(Clubs,6,1)","v":"Halton & Frodsham"},{"$f":"INDEX(Clubs,7,1)","v":"Handforth WAAC"},{"$f":"INDEX(Clubs,8,1)","v":"Leigh H"},{"$f":"INDEX(Clubs,9,1)","v":"Macclesfield H"},{"$f":"INDEX(Clubs,10,1)","v":"Manchester H"},{"$f":"INDEX(Clubs,11,1)","v":"Sale H"},{"$f":"INDEX(Clubs,12,1)","v":"Salford Mets"},{"$f":"INDEX(Clubs,13,1)","v":"Southport Waterloo"},{"$f":"INDEX(Clubs,14,1)","v":"St. Helens Sutton"},{"$f":"INDEX(Clubs,15,1)","v":"Stockport H"},{"$f":"INDEX(Clubs,16,1)","v":"Trafford "},{"$f":"INDEX(Clubs,17,1)","v":"Vale Royal"},{"$f":"INDEX(Clubs,18,1)","v":"Warrington"},{"$f":"INDEX(Clubs,19,1)","v":"West Cheshire"},{"$f":"INDEX(Clubs,20,1)","v":"Wirral AC"},{"$f":"INDEX(Clubs,21,1)","v":"Wrexham"},{"$f":"INDEX(Clubs,1,1)","v":"Altrincham & District"},{"$f":"INDEX(Clubs,2,1)","v":"Colwyn Bay"},{"$f":"INDEX(Clubs,3,1)","v":"Crewe & Nantwich"},{"$f":"INDEX(Clubs,4,1)","v":"Deeside AC"},{"$f":"INDEX(Clubs,5,1)","v":"East Cheshire H"},{"$f":"INDEX(Clubs,6,1)","v":"Halton & Frodsham"},{"$f":"INDEX(Clubs,7,1)","v":"Handforth WAAC"},{"$f":"INDEX(Clubs,8,1)","v":"Leigh H"},{"$f":"INDEX(Clubs,9,1)","v":"Macclesfield H"},{"$f":"INDEX(Clubs,10,1)","v":"Manchester H"},{"$f":"INDEX(Clubs,11,1)","v":"Sale H"},{"$f":"INDEX(Clubs,12,1)","v":"Salford Mets"},{"$f":"INDEX(Clubs,13,1)","v":"Southport Waterloo"},{"$f":"INDEX(Clubs,14,1)","v":"St. Helens Sutton"},{"$f":"INDEX(Clubs,15,1)","v":"Stockport H"},{"$f":"INDEX(Clubs,16,1)","v":"Trafford "},{"$f":"INDEX(Clubs,17,1)","v":"Vale Royal"},{"$f":"INDEX(Clubs,18,1)","v":"Warrington"},{"$f":"INDEX(Clubs,19,1)","v":"West Cheshire"},{"$f":"INDEX(Clubs,20,1)","v":"Wirral AC"},{"$f":"INDEX(Clubs,21,1)","v":"Wrexham"},{"$f":"INDEX(Clubs,1,1)","v":"Altrincham & District"},{"$f":"INDEX(Clubs,2,1)","v":"Colwyn Bay"},{"$f":"INDEX(Clubs,3,1)","v":"Crewe & Nantwich"},{"$f":"INDEX(Clubs,4,1)","v":"Deeside AC"},{"$f":"INDEX(Clubs,5,1)","v":"East Cheshire H"},{"$f":"INDEX(Clubs,6,1)","v":"Halton & Frodsham"},{"$f":"INDEX(Clubs,7,1)","v":"Handforth WAAC"},{"$f":"INDEX(Clubs,8,1)","v":"Leigh H"},{"$f":"INDEX(Clubs,9,1)","v":"Macclesfield H"},{"$f":"INDEX(Clubs,10,1)","v":"Manchester H"},{"$f":"INDEX(Clubs,11,1)","v":"Sale H"},{"$f":"INDEX(Clubs,12,1)","v":"Salford Mets"},{"$f":"INDEX(Clubs,13,1)","v":"Southport Waterloo"},{"$f":"INDEX(Clubs,14,1)","v":"St. Helens Sutton"},{"$f":"INDEX(Clubs,15,1)","v":"Stockport H"},{"$f":"INDEX(Clubs,16,1)","v":"Trafford "},{"$f":"INDEX(Clubs,17,1)","v":"Vale Royal"},{"$f":"INDEX(Clubs,18,1)","v":"Warrington"},{"$f":"INDEX(Clubs,19,1)","v":"West Cheshire"},{"$f":"INDEX(Clubs,20,1)","v":"Wirral AC"},{"$f":"INDEX(Clubs,21,1)","v":"Wrexham"}]
[null,null,null,null,null,"U11s Boys & Girls "]
[]
["Arranged by:",null,{"$f":"ArrangedBy","v":"Handforth W A A C"},null,"Scorer:",null,{"$f":"Scorer","v":"H Branthwaite"},null,null,null,null,null,"Date:",{"$f":"Date","v":"2015-09-13"}]
["Sponsored by:",null,{"$f":"Sponsor","v":"Jones Homes"},null,"Checked by:",null,"S Cathery & M Norman",null,null,null,null,null,null,null,null,null,null,null,null,null,null,null,null,null,null,null,null,"Teams","Athletes"]
["No.","Name","M\nF","Club","100m","Score","800m","Score","Long\nJump","Score","Jav.","Score","Total\nScore\n3 events","Final\nPosit'n","Five\nStar\nAward","Team\nScore",null,"Mix Team Score","Mix\nTeam\nPosition","Rank Ind","Rank Mix","Rank Ind G","Table for Girl","Rank Ind B","Table for boy","Rank mix","Table for table",null,"offset",null,null,null,"M","F",null,null,null,null,null,null,null,null,null,null,null,null,null,null,null,null,null,null,null,null,null,null,null,null,null,null,null,null,null,null,null,null,null,null,null,null,null,null,null,null,null,null,null,null,null,null,null,null,null,null,null,null,null,null,null,null,null,null,null,null,null,null,null,null,null,null,"Last Col"]
[1,"Verbickas, Charlotte","F","Crewe & Nantwich",16.899999999999999,{"$f":"IF(E7=\"DNF\",0,IF(E7=0,0,IF(E7<=14,VLOOKUP(E7,T_100m,15,TRUE),IF(E7<=15.2,VLOOKUP(E7,T_100m,15,TRUE),IF(E7<=21,VLOOKUP(E7-0.01,T_100m,15,TRUE)-1,0)))))","v":32},"00:03:12",{"$f":"IF(G7=\"DNF\",0,IF(G7=0,0,VLOOKUP(G7,T_800m,11,TRUE)-1))","v":54},2.69,{"$f":"IF(I7=\"NJ\",0,IF(I7<'Scoring Tables'!$S$4,0,VLOOKUP(I7,T_Long,11,TRUE)))","v":27},11.26,{"$f":"IF(K7=\"NT\",0,IF(K7<'Scoring Tables'!$X$14,0,VLOOKUP(K7,T_Javlin,6,TRUE)))","v":30},{"$f":"IFERROR((LARGE((F7,H7),1)+J7+L7),0)","v":111},{"$f":"IF(M7=0,0,IF(C7=\"M\",(RANK(M7,AG$7:AG$97)&\"B\"),RANK(M7,AH$7:AH$95)&\"G\"))","v":"11G"},{"$f":"IF(M7<15,0,HLOOKUP(M7,T_U11B_3_Events,3))","v":"3*"},{"$f":"IFERROR(IF(AD7=\"G\",OFFSET($AH$84,VLOOKUP(T7,$AB$94:$AC$105,2,0),AC7,1,1),IF(AD7=\"B\",OFFSET($BC$84,VLOOKUP(T7,$AB$94:$AC$105,2,0),AC7,1,1),0)),0)","v":0},null,{"$f":"IFERROR(OFFSET($BX$84,VLOOKUP(U7,$AB$94:$AC$105,2,0),AC7,1,1),0)","v":0},{"$f":"IF(R7>0,RANK(R7,$BY$85:$CS$87),0)","v":0},{"$f":"RANK(M7,OFFSET($AH$6,0,AC7,64,1))","v":2},{"$f":"RANK(M7,OFFSET($BX$6,0,AC7,64,1))","v":5},{"$f":"IFERROR(IF(Q7=0,0,IF(C7=\"F\",P7*1000+M7,0)),0)","v":0},{"$f":"IF(AND(P7>0,C7=\"F\"), RANK(V7,$V$7:$V$68),\"\")","v":""},{"$f":"IFERROR(IF(P7=0,0,IF(C7=\"M\",P7*1000+M7,0)),0)","v":0},{"$f":"IFERROR(IF(AND(P7>0,C7=\"M\"), RANK(X7,$X$7:$X$68),0),0)","v":0},{"$f":"IFERROR(IF(R7>1,R7*100000+M7*100+ROW(),0),0)","v":0},{"$f":"IFERROR(IF(R7>0, RANK(Z7,$Z$7:$Z$52),0),0)","v":0},{"$f":"IF(C7=\"F\",D7,\"\")","v":"Crewe & Nantwich"},{"$f":"VLOOKUP(D7,ClubIx,2,0)","v":3},{"$f":"IF(C7=\"M\",\"B\",\"G\")","v":"G"},null,null,{"$f":"IF(C7=\"M\",M7,0)","v":0},{"$f":"IF(C7=\"F\",M7,0)","v":111},{"$f":"IF($D7=AI$1,$AH7,0)","v":0},0,111,0,0,0,0,0,0,0,{"$f":"IF($D7=AS$1,$AH7,0)","v":0},0,0,0,0,0,0,0,0,0,0,{"$f":"IF($D7=BD$1,$AG7,0)","v":0},0,0,0,0,0,0,0,0,0,{"$f":"IF($D7=BN$1,$AG7,0)","v":0},0,0,0,0,0,0,0,0,0,0,{"$f":"AI7+BD7","v":0},{"$f":"AJ7+BE7","v":0},{"$f":"AK7+BF7","v":111},{"$f":"AL7+BG7","v":0},{"$f":"AM7+BH7","v":0},{"$f":"AN7+BI7","v":0},{"$f":"AO7+BJ7","v":0},{"$f":"AP7+BK7","v":0},{"$f":"AQ7+BL7","v":0},{"$f":"AR7+BM7","v":0},{"$f":"AS7+BN7","v":0},{"$f":"AT7+BO7","v":0},{"$f":"AU7+BP7","v":0},{"$f":"AV7+BQ7","v":0},{"$f":"AW7+BR7","v":0},{"$f":"AX7+BS7","v":0},{"$f":"AY7+BT7","v":0},{"$f":"AZ7+BU7","v":0},{"$f":"BA7+BV7","v":0},{"$f":"BB7+BW7","v":0},{"$f":"BC7+BX7","v":0}]
[2,"Wilding, Esther","F","Crewe & Nantwich",14.3,67,"00:02:47.700",66,3.62,{"$f":"IF(I8=\"NJ\",0,IF(I8<'Scoring Tables'!$S$4,0,VLOOKUP(I8,T_Long,11,TRUE)))","v":58},11.69,{"$f":"IF(K8=\"NT\",0,IF(K8<'Scoring Tables'!$X$14,0,VLOOKUP(K8,T_Javlin,6,TRUE)))","v":31},{"$f":"IFERROR((LARGE((F8,H8),1)+J8+L8),0)","v":156},"1G",{"$f":"IF(M8<15,0,HLOOKUP(M8,T_U11G_3_Events,3))","v":"5*"},0,null,479,1,{"$f":"RANK(M8,OFFSET($AH$6,0,AC8,64,1))","v":1},2,0,"",0,0,47915608,2,{"$f":"IF(C8=\"F\",D8,\"\")","v":"Crewe & Nantwich"},3,"G",null,null,0,156,0,0,156,0,0,0,0,0,0,0,0,0,0,0,0,0,0,0,0,0,0,0,0,0,0,0,0,0,0,0,0,0,0,0,0,0,0,0,0,0,0,0,0,0,156,0,0,0,0,0,0,0,0,0,0,0,0,0,0,0,0,0,0]
[3,"Carswell, Lauren","F","Halton & Frodsham",15.7,44,null,0,3.03,{"$f":"IF(I9=\"NJ\",0,IF(I9<'Scoring Tables'!$S$4,0,VLOOKUP(I9,T_Long,11,TRUE)))","v":39},9.24,{"$f":"IF(K9=\"NT\",0,IF(K9<'Scoring Tables'!$X$14,0,VLOOKUP(K9,T_Javlin,6,TRUE)))","v":21},{"$f":"IFERROR((LARGE((F9,H9),1)+J9+L9),0)","v":104},"13G",null,0,null,0,0,{"$f":"RANK(M9,OFFSET($AH$6,0,AC9,64,1))","v":1},1,0,"",0,0,0,0,null,6,"G",null,null,0,104,0,0,0,0,0,104,0,0,0,0,0,0,0,0,0,0,0,0,0,0,0,0,0,0,0,0,0,0,0,0,0,0,0,0,0,0,0,0,0,0,0,0,0,0,0,0,0,104,0,0,0,0,0,0,0,0,0,0,0,0,0,0,0]
[4,"Duce, Anna","F","Handforth WAAC",15.7,44,null,0,3.12,{"$f":"IF(I10=\"NJ\",0,IF(I10<'Scoring Tables'!$S$4,0,VLOOKUP(I10,T_Long,11,TRUE)))","v":42},12.28,{"$f":"IF(K10=\"NT\",0,IF(K10<'Scoring Tables'!$X$14,0,VLOOKUP(K10,T_Javlin,6,TRUE)))","v":34},{"$f":"IFERROR((LARGE((F10,H10),1)+J10+L10),0)","v":120},"10G",{"$f":"IF(M10<15,0,HLOOKUP(M10,T_U11B_3_Events,3))","v":"4*"},0,null,326,9,{"$f":"RANK(M10,OFFSET($BC$6,0,AC10,64,1))","v":{"$error":"#N/A"}},1,0,"",0,0,32612010,25,{"$f":"IF(C10=\"M\",D10,\"\")","v":""},7,"G",null,null,0,120,0,0,0,0,0,0,120,0,0,0,0,0,0,0,0,0,0,0,0,0,0,0,0,0,0,0,0,0,0,0,0,0,0,0,0,0,0,0,0,0,0,0,0,0,0,0,0,0,120,0,0,0,0,0,0,0,0,0,0,0,0,0,0]
[5,"Barry, Keira","F","Macclesfield H",14.3,67,"00:03:12.600",53,3.8,{"$f":"IF(I11=\"NJ\",0,IF(I11<'Scoring Tables'!$S$4,0,VLOOKUP(I11,T_Long,11,TRUE)))","v":64},9.23,{"$f":"IF(K11=\"NT\",0,IF(K11<'Scoring Tables'!$X$14,0,VLOOKUP(K11,T_Javlin,6,TRUE)))","v":21},{"$f":"IFERROR((LARGE((F11,H11),1)+J11+L11),0)","v":152},"2G",{"$f":"IF(M11<15,0,HLOOKUP(M11,T_U11G_3_Events,3))","v":"5*"},0,null,425,4,{"$f":"RANK(M11,OFFSET($BC$6,0,AC11,64,1))","v":{"$error":"#N/A"}},1,0,"",0,0,42515211,10,{"$f":"IF(C11=\"M\",D11,\"\")","v":""},9,"G",null,null,0,152,0,0,0,0,0,0,0,0,152,0,0,0,0,0,0,0,0,0,0,0,0,0,0,0,0,0,0,0,0,0,0,0,0,0,0,0,0,0,0,0,0,0,0,0,0,0,0,0,0,0,152,0,0,0,0,0,0,0,0,0,0,0,0]
[6,"Carroll, Serena","F","Macclesfield H",15.3,48,"00:03:24.800",47,3.44,{"$f":"IF(I12=\"NJ\",0,IF(I12<'Scoring Tables'!$S$4,0,VLOOKUP(I12,T_Long,11,TRUE)))","v":52},10.39,{"$f":"IF(K12=\"NT\",0,IF(K12<'Scoring Tables'!$X$14,0,VLOOKUP(K12,T_Javlin,6,TRUE)))","v":26},{"$f":"IFERROR((LARGE((F12,H12),1)+J12+L12),0)","v":126},"8G",{"$f":"IF(M12<15,0,HLOOKUP(M12,T_U11B_3_Events,3))","v":"4*"},0,null,425,4,{"$f":"RANK(M12,OFFSET($BC$6,0,AC12,64,1))","v":{"$error":"#N/A"}},3,0,"",0,0,42512612,12,{"$f":"IF(C12=\"M\",D12,\"\")","v":""},9,"G",null,null,0,126,0,0,0,0,0,0,0,0,126,0,0,0,0,0,0,0,0,0,0,0,0,0,0,0,0,0,0,0,0,0,0,0,0,0,0,0,0,0,0,0,0,0,0,0,0,0,0,0,0,0,126,0,0,0,0,0,0,0,0,0,0,0,0]
[7,"Dilworth, Rebecca","F","Macclesfield H",16.8,33,"00:03:11",54,2.71,{"$f":"IF(I13=\"NJ\",0,IF(I13<'Scoring Tables'!$S$4,0,VLOOKUP(I13,T_Long,11,TRUE)))","v":28},6.65,{"$f":"IF(K13=\"NT\",0,IF(K13<'Scoring Tables'!$X$14,0,VLOOKUP(K13,T_Javlin,6,TRUE)))","v":16},{"$f":"IFERROR((LARGE((F13,H13),1)+J13+L13),0)","v":98},"17G",{"$f":"IF(M13<15,0,HLOOKUP(M13,T_U11B_3_Events,3))","v":"3*"},376,null,0,0,{"$f":"RANK(M13,OFFSET($AH$6,0,AC13,64,1))","v":3},4,0,1,0,0,0,0,{"$f":"IF(C13=\"F\",D13,\"\")","v":"Macclesfield H"},9,"G",null,null,0,98,0,0,0,0,0,0,0,0,98,0,0,0,0,0,0,0,0,0,0,0,0,0,0,0,0,0,0,0,0,0,0,0,0,0,0,0,0,0,0,0,0,0,0,0,0,0,0,0,0,0,98,0,0,0,0,0,0,0,0,0,0,0,0]
[8,"Dutton, Lily","F","Macclesfield H",16.5,36,null,0,2.82,{"$f":"IF(I14=\"NJ\",0,IF(I14<'Scoring Tables'!$S$4,0,VLOOKUP(I14,T_Long,11,TRUE)))","v":32},9.82,{"$f":"IF(K14=\"NT\",0,IF(K14<'Scoring Tables'!$X$14,0,VLOOKUP(K14,T_Javlin,6,TRUE)))","v":24},{"$f":"IFERROR((LARGE((F14,H14),1)+J14+L14),0)","v":92},"18G",{"$f":"IF(M14<15,0,HLOOKUP(M14,T_U11B_3_Events,3))","v":"3*"},0,null,0,0,{"$f":"RANK(M14,OFFSET($BC$6,0,AC14,64,1))","v":{"$error":"#N/A"}},5,0,"",0,0,0,0,{"$f":"IF(C14=\"M\",D14,\"\")","v":""},9,"G",null,null,0,92,0,0,0,0,0,0,0,0,92,0,0,0,0,0,0,0,0,0,0,0,0,0,0,0,0,0,0,0,0,0,0,0,0,0,0,0,0,0,0,0,0,0,0,0,0,0,0,0,0,0,92,0,0,0,0,0,0,0,0,0,0,0,0]
[9,"Mason, Hermione","F","Sale H",16.100000000000001,40,"00:02:55.300",62,3.24,{"$f":"IF(I15=\"NJ\",0,IF(I15<'Scoring Tables'!$S$4,0,VLOOKUP(I15,T_Long,11,TRUE)))","v":46},9.43,{"$f":"IF(K15=\"NT\",0,IF(K15<'Scoring Tables'!$X$14,0,VLOOKUP(K15,T_Javlin,6,TRUE)))","v":22},{"$f":"IFERROR((LARGE((F15,H15),1)+J15+L15),0)","v":130},"5G",{"$f":"IF(M15<15,0,HLOOKUP(M15,T_U11B_3_Events,3))","v":"4*"},0,null,0,0,{"$f":"RANK(M15,OFFSET($AH$6,0,AC15,64,1))","v":1},2,0,"",0,0,0,0,{"$f":"IF(C15=\"F\",D15,\"\")","v":"Sale H"},11,"G",null,null,0,130,0,0,0,0,0,0,0,0,0,0,130,0,0,0,0,0,0,0,0,0,0,0,0,0,0,0,0,0,0,0,0,0,0,0,0,0,0,0,0,0,0,0,0,0,0,0,0,0,0,0,0,0,130,0,0,0,0,0,0,0,0,0,0]
[10,"Hopkins, Michaela","F","Southport Waterloo",18.3,18,"00:03:13.300",53,2.94,{"$f":"IF(I16=\"NJ\",0,IF(I16<'Scoring Tables'!$S$4,0,VLOOKUP(I16,T_Long,11,TRUE)))","v":36},5.72,{"$f":"IF(K16=\"NT\",0,IF(K16<'Scoring Tables'!$X$14,0,VLOOKUP(K16,T_Javlin,6,TRUE)))","v":14},{"$f":"IFERROR((LARGE((F16,H16),1)+J16+L16),0)","v":103},"14G",{"$f":"IF(M16<15,0,HLOOKUP(M16,T_U11B_3_Events,3))","v":"3*"},0,null,0,0,{"$f":"RANK(M16,OFFSET($BC$6,0,AC16,64,1))","v":{"$error":"#N/A"}},1,0,"",0,0,0,0,{"$f":"IF(C16=\"M\",D16,\"\")","v":""},13,"G",null,null,0,103,0,0,0,0,0,0,0,0,0,0,0,0,103,0,0,0,0,0,0,0,0,0,0,0,0,0,0,0,0,0,0,0,0,0,0,0,0,0,0,0,0,0,0,0,0,0,0,0,0,0,0,0,0,0,103,0,0,0,0,0,0,0,0]
[11,"Martin, Libby","F","Stockport H",18.2,19,"00:03:12.500",53,2.16,{"$f":"IF(I17=\"NJ\",0,IF(I17<'Scoring Tables'!$S$4,0,VLOOKUP(I17,T_Long,11,TRUE)))","v":10},8.52,{"$f":"IF(K17=\"NT\",0,IF(K17<'Scoring Tables'!$X$14,0,VLOOKUP(K17,T_Javlin,6,TRUE)))","v":20},{"$f":"IFERROR((LARGE((F17,H17),1)+J17+L17),0)","v":83},"19G",{"$f":"IF(M17<15,0,HLOOKUP(M17,T_U11G_3_Events,3))","v":"3*"},0,null,0,0,{"$f":"RANK(M17,OFFSET($AH$6,0,AC17,64,1))","v":1},4,0,"",0,0,0,0,{"$f":"IF(C17=\"F\",D17,\"\")","v":"Stockport H"},15,"G",null,null,0,83,{"$f":"IF($D17=AI$1,$AH17,0)","v":0},0,0,0,0,0,0,0,0,0,{"$f":"IF($D17=AS$1,$AH17,0)","v":0},0,0,0,83,0,0,0,0,0,0,{"$f":"IF($D17=BD$1,$AG17,0)","v":0},0,0,0,0,0,0,0,0,0,{"$f":"IF($D17=BN$1,$AG17,0)","v":0},0,0,0,0,0,0,0,0,0,0,0,0,0,0,0,0,0,0,0,0,0,0,0,0,83,0,0,0,0,0,0]
[12,"Gibbs, Tilly","F","Vale Royal",16.399999999999999,37,"00:03:19.300",50,2.15,{"$f":"IF(I18=\"NJ\",0,IF(I18<'Scoring Tables'!$S$4,0,VLOOKUP(I18,T_Long,11,TRUE)))","v":9},14.7,{"$f":"IF(K18=\"NT\",0,IF(K18<'Scoring Tables'!$X$14,0,VLOOKUP(K18,T_Javlin,6,TRUE)))","v":43},{"$f":"IFERROR((LARGE((F18,H18),1)+J18+L18),0)","v":102},"15G",{"$f":"IF(M18<15,0,HLOOKUP(M18,T_U11G_3_Events,3))","v":"4*"},341,null,0,0,{"$f":"RANK(M18,OFFSET($AH$6,0,AC18,64,1))","v":3},8,0,1,0,0,0,0,{"$f":"IF(C18=\"F\",D18,\"\")","v":"Vale Royal"},17,"G",null,null,0,102,0,0,0,0,0,0,0,0,0,0,0,0,0,0,0,0,102,0,0,0,0,0,0,0,0,0,0,0,0,0,0,0,0,0,0,0,0,0,0,0,0,0,0,0,0,0,0,0,0,0,0,0,0,0,0,0,0,0,102,0,0,0,0]
[13,"Sproston, Hannah","F","Vale Royal",15.7,44,"00:03:07.400",56,3.38,{"$f":"IF(I19=\"NJ\",0,IF(I19<'Scoring Tables'!$S$4,0,VLOOKUP(I19,T_Long,11,TRUE)))","v":50},9.65,{"$f":"IF(K19=\"NT\",0,IF(K19<'Scoring Tables'!$X$14,0,VLOOKUP(K19,T_Javlin,6,TRUE)))","v":23},{"$f":"IFERROR((LARGE((F19,H19),1)+J19+L19),0)","v":129},"6G",{"$f":"IF(M19<15,0,HLOOKUP(M19,T_U11B_3_Events,3))","v":"4*"},341,null,364,7,{"$f":"RANK(M19,OFFSET($AH$6,0,AC19,64,1))","v":1},4,0,1,0,0,36412919,19,{"$f":"IF(C19=\"F\",D19,\"\")","v":"Vale Royal"},17,"G",null,null,0,129,0,0,0,0,0,0,0,0,0,0,0,0,0,0,0,0,129,0,0,0,0,0,0,0,0,0,0,0,0,0,0,0,0,0,0,0,0,0,0,0,0,0,0,0,0,0,0,0,0,0,0,0,0,0,0,0,0,0,129,0,0,0,0]
[14,"Stapleton, Scarlett","F","Vale Royal",16.2,39,"00:03:15.900",52,3.08,{"$f":"IF(I20=\"NJ\",0,IF(I20<'Scoring Tables'!$S$4,0,VLOOKUP(I20,T_Long,11,TRUE)))","v":40},7.6,{"$f":"IF(K20=\"NT\",0,IF(K20<'Scoring Tables'!$X$14,0,VLOOKUP(K20,T_Javlin,6,TRUE)))","v":18},{"$f":"IFERROR((LARGE((F20,H20),1)+J20+L20),0)","v":110},"12G",{"$f":"IF(M20<15,0,HLOOKUP(M20,T_U11G_3_Events,3))","v":"4*"},0,null,364,7,{"$f":"RANK(M20,OFFSET($BC$6,0,AC20,64,1))","v":{"$error":"#N/A"}},6,0,"",0,0,36411020,21,{"$f":"IF(C20=\"M\",D20,\"\")","v":""},17,"G",null,null,0,110,0,0,0,0,0,0,0,0,0,0,0,0,0,0,0,0,110,0,0,0,0,0,0,0,0,0,0,0,0,0,0,0,0,0,0,0,0,0,0,0,0,0,0,0,0,0,0,0,0,0,0,0,0,0,0,0,0,0,110,0,0,0,0]
[15,"Battersby, Lara","F","West Cheshire",null,0,null,0,null,{"$f":"IF(I21=\"NJ\",0,IF(I21<'Scoring Tables'!$S$4,0,VLOOKUP(I21,T_Long,11,TRUE)))","v":0},null,{"$f":"IF(K21=\"NT\",0,IF(K21<'Scoring Tables'!$X$14,0,VLOOKUP(K21,T_Javlin,6,TRUE)))","v":0},{"$f":"IFERROR((LARGE((F21,H21),1)+J21+L21),0)","v":0},0,{"$f":"IF(M21<15,0,HLOOKUP(M21,T_U11B_3_Events,3))","v":0},0,null,0,0,{"$f":"RANK(M21,OFFSET($BC$6,0,AC21,64,1))","v":5},10,0,"",0,0,0,0,{"$f":"IF(C21=\"M\",D21,\"\")","v":""},19,"G",null,null,0,0,0,0,0,0,0,0,0,0,0,0,0,0,0,0,0,0,0,0,0,0,0,0,0,0,0,0,0,0,0,0,0,0,0,0,0,0,0,0,0,0,0,0,0,0,0,0,0,0,0,0,0,0,0,0,0,0,0,0,0,0,0,0,0]
[16,"Bemand, Jodi","F","West Cheshire",16.2,39,"00:03:32.900",43,2.89,{"$f":"IF(I22=\"NJ\",0,IF(I22<'Scoring Tables'!$S$4,0,VLOOKUP(I22,T_Long,11,TRUE)))","v":34},9.89,{"$f":"IF(K22=\"NT\",0,IF(K22<'Scoring Tables'!$X$14,0,VLOOKUP(K22,T_Javlin,6,TRUE)))","v":24},{"$f":"IFERROR((LARGE((F22,H22),1)+J22+L22),0)","v":101},"16G","3*",0,null,337,8,{"$f":"RANK(M22,OFFSET($BC$6,0,AC22,64,1))","v":{"$error":"#N/A"}},9,0,"",0,0,33710122,24,{"$f":"IF(C22=\"M\",D22,\"\")","v":""},19,"G",null,null,0,101,0,0,0,0,0,0,0,0,0,0,0,0,0,0,0,0,0,0,101,0,0,0,0,0,0,0,0,0,0,0,0,0,0,0,0,0,0,0,0,0,0,0,0,0,0,0,0,0,0,0,0,0,0,0,0,0,0,0,0,0,101,0,0]
[17,"Bojang, Fatoumatta","F","West Cheshire",15.2,49,"00:02:54.800",62,3.41,{"$f":"IF(I23=\"NJ\",0,IF(I23<'Scoring Tables'!$S$4,0,VLOOKUP(I23,T_Long,11,TRUE)))","v":51},10.43,{"$f":"IF(K23=\"NT\",0,IF(K23<'Scoring Tables'!$X$14,0,VLOOKUP(K23,T_Javlin,6,TRUE)))","v":26},{"$f":"IFERROR((LARGE((F23,H23),1)+J23+L23),0)","v":139},"3G","4*",400,null,400,5,{"$f":"RANK(M23,OFFSET($AH$6,0,AC23,64,1))","v":1},4,0,1,0,0,40013923,13,{"$f":"IF(C23=\"F\",D23,\"\")","v":"West Cheshire"},19,"G",null,null,0,139,0,0,0,0,0,0,0,0,0,0,0,0,0,0,0,0,0,0,139,0,0,0,0,0,0,0,0,0,0,0,0,0,0,0,0,0,0,0,0,0,0,0,0,0,0,0,0,0,0,0,0,0,0,0,0,0,0,0,0,0,139,0,0]
[18,"Jones, Stephanie","F","West Cheshire",15.1,51,"00:02:58.700",60,3.4,{"$f":"IF(I24=\"NJ\",0,IF(I24<'Scoring Tables'!$S$4,0,VLOOKUP(I24,T_Long,11,TRUE)))","v":51},7.2,{"$f":"IF(K24=\"NT\",0,IF(K24<'Scoring Tables'!$X$14,0,VLOOKUP(K24,T_Javlin,6,TRUE)))","v":17},{"$f":"IFERROR((LARGE((F24,H24),1)+J24+L24),0)","v":128},"7G","4*",400,null,400,5,{"$f":"RANK(M24,OFFSET($AH$6,0,AC24,64,1))","v":3},6,0,1,0,0,40012824,15,{"$f":"IF(C24=\"F\",D24,\"\")","v":"West Cheshire"},19,"G",null,null,0,128,0,0,0,0,0,0,0,0,0,0,0,0,0,0,0,0,0,0,128,0,0,0,0,0,0,0,0,0,0,0,0,0,0,0,0,0,0,0,0,0,0,0,0,0,0,0,0,0,0,0,0,0,0,0,0,0,0,0,0,0,128,0,0]
[19,"Pawlett, Emily","F","West Cheshire",null,0,null,0,null,{"$f":"IF(I25=\"NJ\",0,IF(I25<'Scoring Tables'!$S$4,0,VLOOKUP(I25,T_Long,11,TRUE)))","v":0},null,{"$f":"IF(K25=\"NT\",0,IF(K25<'Scoring Tables'!$X$14,0,VLOOKUP(K25,T_Javlin,6,TRUE)))","v":0},{"$f":"IFERROR((LARGE((F25,H25),1)+J25+L25),0)","v":0},0,0,0,null,0,0,{"$f":"RANK(M25,OFFSET($AH$6,0,AC25,64,1))","v":6},10,0,"",0,0,0,0,{"$f":"IF(C25=\"F\",D25,\"\")","v":"West Cheshire"},19,"G",null,null,0,0,0,0,0,0,0,0,0,0,0,0,0,0,0,0,0,0,0,0,0,0,0,0,0,0,0,0,0,0,0,0,0,0,0,0,0,0,0,0,0,0,0,0,0,0,0,0,0,0,0,0,0,0,0,0,0,0,0,0,0,0,0,0,0]
[20,"Pughe, Imogen","F","West Cheshire",15.9,42,"00:03:02.400",58,3.01,{"$f":"IF(I26=\"NJ\",0,IF(I26<'Scoring Tables'!$S$4,0,VLOOKUP(I26,T_Long,11,TRUE)))","v":38},13.11,{"$f":"IF(K26=\"NT\",0,IF(K26<'Scoring Tables'!$X$14,0,VLOOKUP(K26,T_Javlin,6,TRUE)))","v":37},{"$f":"IFERROR((LARGE((F26,H26),1)+J26+L26),0)","v":133},"4G","4*",0,null,400,5,{"$f":"RANK(M26,OFFSET($BC$6,0,AC26,64,1))","v":{"$error":"#N/A"}},5,0,"",0,0,40013326,14,{"$f":"IF(C26=\"M\",D26,\"\")","v":""},19,"G",null,null,0,133,0,0,0,0,0,0,0,0,0,0,0,0,0,0,0,0,0,0,133,0,0,0,0,0,0,0,0,0,0,0,0,0,0,0,0,0,0,0,0,0,0,0,0,0,0,0,0,0,0,0,0,0,0,0,0,0,0,0,0,0,133,0,0]
[21,"Roberts, Carys","F","West Cheshire",null,0,null,0,null,{"$f":"IF(I27=\"NJ\",0,IF(I27<'Scoring Tables'!$S$4,0,VLOOKUP(I27,T_Long,11,TRUE)))","v":0},null,{"$f":"IF(K27=\"NT\",0,IF(K27<'Scoring Tables'!$X$14,0,VLOOKUP(K27,T_Javlin,6,TRUE)))","v":0},{"$f":"IFERROR((LARGE((F27,H27),1)+J27+L27),0)","v":0},0,0,0,null,0,0,{"$f":"RANK(M27,OFFSET($AH$6,0,AC27,64,1))","v":6},10,0,"",0,0,0,0,{"$f":"IF(C27=\"F\",D27,\"\")","v":"West Cheshire"},19,"G",null,null,0,0,{"$f":"IF($D27=AI$1,$AH27,0)","v":0},0,0,0,0,0,0,0,0,0,{"$f":"IF($D27=AS$1,$AH27,0)","v":0},0,0,0,0,0,0,0,0,0,0,{"$f":"IF($D27=BD$1,$AG27,0)","v":0},0,0,0,0,0,0,0,0,0,{"$f":"IF($D27=BN$1,$AG27,0)","v":0},0,0,0,0,0,0,0,0,0,0,0,0,0,0,0,0,0,0,0,0,0,0,0,0,0,0,0,0,0,0,0]
[22,"Shillington, Isla","F","West Cheshire",17.100000000000001,30,"00:03:17.800",51,3.03,{"$f":"IF(I28=\"NJ\",0,IF(I28<'Scoring Tables'!$S$4,0,VLOOKUP(I28,T_Long,11,TRUE)))","v":39},11.78,{"$f":"IF(K28=\"NT\",0,IF(K28<'Scoring Tables'!$X$14,0,VLOOKUP(K28,T_Javlin,6,TRUE)))","v":32},{"$f":"IFERROR((LARGE((F28,H28),1)+J28+L28),0)","v":122},"9G",{"$f":"IF(M28<15,0,HLOOKUP(M28,T_U11G_3_Events,3))","v":"4*"},0,null,337,8,{"$f":"RANK(M28,OFFSET($AH$6,0,AC28,64,1))","v":4},7,0,"",0,0,33712228,22,{"$f":"IF(C28=\"F\",D28,\"\")","v":"West Cheshire"},19,"G",null,null,0,122,0,0,0,0,0,0,0,0,0,0,0,0,0,0,0,0,0,0,122,0,0,0,0,0,0,0,0,0,0,0,0,0,0,0,0,0,0,0,0,0,0,0,0,0,0,0,0,0,0,0,0,0,0,0,0,0,0,0,0,0,122,0,0]
[23,"Atkinson, Oliver","M","Crewe & Nantwich",14.8,57,"00:02:41.800",69,3.49,{"$f":"IF(I29=\"NJ\",0,IF(I29<'Scoring Tables'!$S$4,0,VLOOKUP(I29,T_Long,11,TRUE)))","v":54},20.420000000000002,{"$f":"IF(K29=\"NT\",0,IF(K29<'Scoring Tables'!$X$14,0,VLOOKUP(K29,T_Javlin,6,TRUE)))","v":66},{"$f":"IFERROR((LARGE((F29,H29),1)+J29+L29),0)","v":189},"1B",{"$f":"IF(M29<15,0,HLOOKUP(M29,T_U11B_3_Events,3))","v":"5*"},0,null,479,1,{"$f":"RANK(M29,OFFSET($AH$6,0,AC29,64,1))","v":{"$error":"#N/A"}},1,0,"",0,0,47918929,1,{"$f":"IF(C29=\"F\",D29,\"\")","v":""},3,"B",null,null,189,0,0,0,0,0,0,0,0,0,0,0,0,0,0,0,0,0,0,0,0,0,0,0,0,189,0,0,0,0,0,0,0,0,0,0,0,0,0,0,0,0,0,0,0,0,189,0,0,0,0,0,0,0,0,0,0,0,0,0,0,0,0,0,0]
[24,"Jenkins, Hadyn","M","Crewe & Nantwich",15.7,44,"00:03:00.500",59,2.67,{"$f":"IF(I30=\"NJ\",0,IF(I30<'Scoring Tables'!$S$4,0,VLOOKUP(I30,T_Long,11,TRUE)))","v":27},10.68,{"$f":"IF(K30=\"NT\",0,IF(K30<'Scoring Tables'!$X$14,0,VLOOKUP(K30,T_Javlin,6,TRUE)))","v":27},{"$f":"IFERROR((LARGE((F30,H30),1)+J30+L30),0)","v":113},"14B",{"$f":"IF(M30<15,0,HLOOKUP(M30,T_U11G_3_Events,3))","v":"4*"},436,null,0,0,{"$f":"RANK(M30,OFFSET($BC$6,0,AC30,64,1))","v":3},4,0,"",436113,3,0,0,{"$f":"IF(C30=\"M\",D30,\"\")","v":"Crewe & Nantwich"},3,"B",null,null,113,0,0,0,0,0,0,0,0,0,0,0,0,0,0,0,0,0,0,0,0,0,0,0,0,113,0,0,0,0,0,0,0,0,0,0,0,0,0,0,0,0,0,0,0,0,113,0,0,0,0,0,0,0,0,0,0,0,0,0,0,0,0,0,0]
[25,"Stokes, Thomas","M","Crewe & Nantwich",15.7,44,"00:02:59.600",60,2.94,{"$f":"IF(I31=\"NJ\",0,IF(I31<'Scoring Tables'!$S$4,0,VLOOKUP(I31,T_Long,11,TRUE)))","v":36},13.35,{"$f":"IF(K31=\"NT\",0,IF(K31<'Scoring Tables'!$X$14,0,VLOOKUP(K31,T_Javlin,6,TRUE)))","v":38},{"$f":"IFERROR((LARGE((F31,H31),1)+J31+L31),0)","v":134},"11B",{"$f":"IF(M31<15,0,HLOOKUP(M31,T_U11G_3_Events,3))","v":"4*"},0,null,479,1,{"$f":"RANK(M31,OFFSET($AH$6,0,AC31,64,1))","v":{"$error":"#N/A"}},3,0,"",0,0,47913431,3,{"$f":"IF(C31=\"F\",D31,\"\")","v":""},3,"B",null,null,134,0,0,0,0,0,0,0,0,0,0,0,0,0,0,0,0,0,0,0,0,0,0,0,0,134,0,0,0,0,0,0,0,0,0,0,0,0,0,0,0,0,0,0,0,0,134,0,0,0,0,0,0,0,0,0,0,0,0,0,0,0,0,0,0]
[26,"Branthwaite, Owen","M","Handforth WAAC",16.5,36,null,0,2.82,{"$f":"IF(I32=\"NJ\",0,IF(I32<'Scoring Tables'!$S$4,0,VLOOKUP(I32,T_Long,11,TRUE)))","v":32},12.66,{"$f":"IF(K32=\"NT\",0,IF(K32<'Scoring Tables'!$X$14,0,VLOOKUP(K32,T_Javlin,6,TRUE)))","v":35},{"$f":"IFERROR((LARGE((F32,H32),1)+J32+L32),0)","v":103},"16B",{"$f":"IF(M32<15,0,HLOOKUP(M32,T_U11B_3_Events,3))","v":"3*"},0,null,326,9,{"$f":"RANK(M32,OFFSET($AH$6,0,AC32,64,1))","v":{"$error":"#N/A"}},2,0,"",0,0,32610332,27,{"$f":"IF(C32=\"F\",D32,\"\")","v":""},7,"B",null,null,103,0,0,0,0,0,0,0,0,0,0,0,0,0,0,0,0,0,0,0,0,0,0,0,0,0,0,0,0,103,0,0,0,0,0,0,0,0,0,0,0,0,0,0,0,0,0,0,0,0,103,0,0,0,0,0,0,0,0,0,0,0,0,0,0]
[27,"Cann, Marcus","M","Handforth WAAC",17.100000000000001,30,"00:03:01",59,2.27,{"$f":"IF(I33=\"NJ\",0,IF(I33<'Scoring Tables'!$S$4,0,VLOOKUP(I33,T_Long,11,TRUE)))","v":13},11.55,{"$f":"IF(K33=\"NT\",0,IF(K33<'Scoring Tables'!$X$14,0,VLOOKUP(K33,T_Javlin,6,TRUE)))","v":31},{"$f":"IFERROR((LARGE((F33,H33),1)+J33+L33),0)","v":103},"16B","3*",0,null,326,9,{"$f":"RANK(M33,OFFSET($AH$6,0,AC33,64,1))","v":{"$error":"#N/A"}},2,0,"",0,0,32610333,26,{"$f":"IF(C33=\"F\",D33,\"\")","v":""},7,"B",null,null,103,0,0,0,0,0,0,0,0,0,0,0,0,0,0,0,0,0,0,0,0,0,0,0,0,0,0,0,0,103,0,0,0,0,0,0,0,0,0,0,0,0,0,0,0,0,0,0,0,0,103,0,0,0,0,0,0,0,0,0,0,0,0,0,0]
[28,"Blunn, Hayden","M","Macclesfield H",15.3,48,"00:02:50.900",64,3.32,{"$f":"IF(I34=\"NJ\",0,IF(I34<'Scoring Tables'!$S$4,0,VLOOKUP(I34,T_Long,11,TRUE)))","v":48},12.67,{"$f":"IF(K34=\"NT\",0,IF(K34<'Scoring Tables'!$X$14,0,VLOOKUP(K34,T_Javlin,6,TRUE)))","v":35},{"$f":"IFERROR((LARGE((F34,H34),1)+J34+L34),0)","v":147},"5B","4*",0,null,425,4,{"$f":"RANK(M34,OFFSET($BC$6,0,AC34,64,1))","v":1},2,0,"",0,0,42514734,11,{"$f":"IF(C34=\"M\",D34,\"\")","v":"Macclesfield H"},9,"B",null,null,147,0,0,0,0,0,0,0,0,0,0,0,0,0,0,0,0,0,0,0,0,0,0,0,0,0,0,0,0,0,0,147,0,0,0,0,0,0,0,0,0,0,0,0,0,0,0,0,0,0,0,0,147,0,0,0,0,0,0,0,0,0,0,0,0]
[29,"Danson, Thomas","M","Macclesfield H",null,0,null,0,null,{"$f":"IF(I35=\"NJ\",0,IF(I35<'Scoring Tables'!$S$4,0,VLOOKUP(I35,T_Long,11,TRUE)))","v":0},null,{"$f":"IF(K35=\"NT\",0,IF(K35<'Scoring Tables'!$X$14,0,VLOOKUP(K35,T_Javlin,6,TRUE)))","v":0},{"$f":"IFERROR((LARGE((F35,H35),1)+J35+L35),0)","v":0},0,0,0,null,0,0,{"$f":"RANK(M35,OFFSET($AH$6,0,AC35,64,1))","v":5},6,0,"",0,0,0,0,{"$f":"IF(C35=\"F\",D35,\"\")","v":""},9,"B",null,null,0,0,0,0,0,0,0,0,0,0,0,0,0,0,0,0,0,0,0,0,0,0,0,0,0,0,0,0,0,0,0,0,0,0,0,0,0,0,0,0,0,0,0,0,0,0,0,0,0,0,0,0,0,0,0,0,0,0,0,0,0,0,0,0,0]
[30,"Boyd, Thomas","M","Sale H",15.5,46,"00:02:40.700",69,3.57,{"$f":"IF(I36=\"NJ\",0,IF(I36<'Scoring Tables'!$S$4,0,VLOOKUP(I36,T_Long,11,TRUE)))","v":57},13.13,{"$f":"IF(K36=\"NT\",0,IF(K36<'Scoring Tables'!$X$14,0,VLOOKUP(K36,T_Javlin,6,TRUE)))","v":37},{"$f":"IFERROR((LARGE((F36,H36),1)+J36+L36),0)","v":163},"3B","5*",0,null,0,0,{"$f":"RANK(M36,OFFSET($BC$6,0,AC36,64,1))","v":1},1,0,"",0,0,0,0,{"$f":"IF(C36=\"M\",D36,\"\")","v":"Sale H"},11,"B",null,null,163,0,0,0,0,0,0,0,0,0,0,0,0,0,0,0,0,0,0,0,0,0,0,0,0,0,0,0,0,0,0,0,0,163,0,0,0,0,0,0,0,0,0,0,0,0,0,0,0,0,0,0,0,0,163,0,0,0,0,0,0,0,0,0,0]
[31,"Ayre, Sam","M","Stockport H",15.6,45,null,0,2.88,{"$f":"IF(I37=\"NJ\",0,IF(I37<'Scoring Tables'!$S$4,0,VLOOKUP(I37,T_Long,11,TRUE)))","v":34},9.56,{"$f":"IF(K37=\"NT\",0,IF(K37<'Scoring Tables'!$X$14,0,VLOOKUP(K37,T_Javlin,6,TRUE)))","v":23},{"$f":"IFERROR((LARGE((F37,H37),1)+J37+L37),0)","v":102},"18B","3*",370,null,370,6,{"$f":"RANK(M37,OFFSET($BC$6,0,AC37,64,1))","v":2},2,0,"",370102,6,37010237,17,{"$f":"IF(C37=\"M\",D37,\"\")","v":"Stockport H"},15,"B",null,null,102,0,{"$f":"IF($D37=AI$1,$AH37,0)","v":0},0,0,0,0,0,0,0,0,0,{"$f":"IF($D37=AS$1,$AH37,0)","v":0},0,0,0,0,0,0,0,0,0,0,{"$f":"IF($D37=BD$1,$AG37,0)","v":0},0,0,0,0,0,0,0,0,0,{"$f":"IF($D37=BN$1,$AG37,0)","v":0},0,0,0,102,0,0,0,0,0,0,0,0,0,0,0,0,0,0,0,0,0,0,0,0,102,0,0,0,0,0,0]
[32,"Culmer, Frank","M","Stockport H",null,0,null,0,null,{"$f":"IF(I38=\"NJ\",0,IF(I38<'Scoring Tables'!$S$4,0,VLOOKUP(I38,T_Long,11,TRUE)))","v":0},null,{"$f":"IF(K38=\"NT\",0,IF(K38<'Scoring Tables'!$X$14,0,VLOOKUP(K38,T_Javlin,6,TRUE)))","v":0},{"$f":"IFERROR((LARGE((F38,H38),1)+J38+L38),0)","v":0},0,{"$f":"IF(M38<15,0,HLOOKUP(M38,T_U11G_3_Events,3))","v":0},370,null,0,0,{"$f":"RANK(M38,OFFSET($AH$6,0,AC38,64,1))","v":2},5,0,"",370000,7,0,0,{"$f":"IF(C38=\"F\",D38,\"\")","v":""},15,"B",null,null,0,0,0,0,0,0,0,0,0,0,0,0,0,0,0,0,0,0,0,0,0,0,0,0,0,0,0,0,0,0,0,0,0,0,0,0,0,0,0,0,0,0,0,0,0,0,0,0,0,0,0,0,0,0,0,0,0,0,0,0,0,0,0,0,0]
[33,"Culmer, Tom","M","Stockport H",18.2,19,"00:03:31.100",44,2.5499999999999998,{"$f":"IF(I39=\"NJ\",0,IF(I39<'Scoring Tables'!$S$4,0,VLOOKUP(I39,T_Long,11,TRUE)))","v":23},11.93,{"$f":"IF(K39=\"NT\",0,IF(K39<'Scoring Tables'!$X$14,0,VLOOKUP(K39,T_Javlin,6,TRUE)))","v":32},{"$f":"IFERROR((LARGE((F39,H39),1)+J39+L39),0)","v":99},"19B",{"$f":"IF(M39<15,0,HLOOKUP(M39,T_U11B_3_Events,3))","v":"3*"},0,null,370,6,{"$f":"RANK(M39,OFFSET($AH$6,0,AC39,64,1))","v":{"$error":"#N/A"}},3,0,"",0,0,37009939,18,{"$f":"IF(C39=\"F\",D39,\"\")","v":""},15,"B",null,null,99,0,0,0,0,0,0,0,0,0,0,0,0,0,0,0,0,0,0,0,0,0,0,0,0,0,0,0,0,0,0,0,0,0,0,0,0,99,0,0,0,0,0,0,0,0,0,0,0,0,0,0,0,0,0,0,0,0,99,0,0,0,0,0,0]
[34,"Doodson, Jack","M","Stockport H",15,53,"00:02:57.600",61,3.91,{"$f":"IF(I40=\"NJ\",0,IF(I40<'Scoring Tables'!$S$4,0,VLOOKUP(I40,T_Long,11,TRUE)))","v":68},13.93,{"$f":"IF(K40=\"NT\",0,IF(K40<'Scoring Tables'!$X$14,0,VLOOKUP(K40,T_Javlin,6,TRUE)))","v":40},{"$f":"IFERROR((LARGE((F40,H40),1)+J40+L40),0)","v":169},"2B",{"$f":"IF(M40<15,0,HLOOKUP(M40,T_U11B_3_Events,3))","v":"5*"},0,null,370,6,{"$f":"RANK(M40,OFFSET($AH$6,0,AC40,64,1))","v":{"$error":"#N/A"}},1,0,"",0,0,37016940,16,{"$f":"IF(C40=\"F\",D40,\"\")","v":""},15,"B",null,null,169,0,0,0,0,0,0,0,0,0,0,0,0,0,0,0,0,0,0,0,0,0,0,0,0,0,0,0,0,0,0,0,0,0,0,0,0,169,0,0,0,0,0,0,0,0,0,0,0,0,0,0,0,0,0,0,0,0,169,0,0,0,0,0,0]
[35,"McCann, Daniel","M","Stockport H",null,0,null,0,null,{"$f":"IF(I41=\"NJ\",0,IF(I41<'Scoring Tables'!$S$4,0,VLOOKUP(I41,T_Long,11,TRUE)))","v":0},null,{"$f":"IF(K41=\"NT\",0,IF(K41<'Scoring Tables'!$X$14,0,VLOOKUP(K41,T_Javlin,6,TRUE)))","v":0},{"$f":"IFERROR((LARGE((F41,H41),1)+J41+L41),0)","v":0},0,{"$f":"IF(M41<15,0,HLOOKUP(M41,T_U11G_3_Events,3))","v":0},370,null,0,0,{"$f":"RANK(M41,OFFSET($AH$6,0,AC41,64,1))","v":2},5,0,"",370000,7,0,0,{"$f":"IF(C41=\"F\",D41,\"\")","v":""},15,"B",null,null,0,0,0,0,0,0,0,0,0,0,0,0,0,0,0,0,0,0,0,0,0,0,0,0,0,0,0,0,0,0,0,0,0,0,0,0,0,0,0,0,0,0,0,0,0,0,0,0,0,0,0,0,0,0,0,0,0,0,0,0,0,0,0,0,0]
[36,"Carney, Dylan","M","Vale Royal",16.8,33,"00:02:40",70,2.79,{"$f":"IF(I42=\"NJ\",0,IF(I42<'Scoring Tables'!$S$4,0,VLOOKUP(I42,T_Long,11,TRUE)))","v":31},14.6,{"$f":"IF(K42=\"NT\",0,IF(K42<'Scoring Tables'!$X$14,0,VLOOKUP(K42,T_Javlin,6,TRUE)))","v":43},{"$f":"IFERROR((LARGE((F42,H42),1)+J42+L42),0)","v":144},"8B",{"$f":"IF(M42<15,0,HLOOKUP(M42,T_U11B_3_Events,3))","v":"4*"},440,null,440,2,{"$f":"RANK(M42,OFFSET($BC$6,0,AC42,64,1))","v":2},2,0,"",440144,2,44014442,5,{"$f":"IF(C42=\"M\",D42,\"\")","v":"Vale Royal"},17,"B",null,null,144,0,0,0,0,0,0,0,0,0,0,0,0,0,0,0,0,0,0,0,0,0,0,0,0,0,0,0,0,0,0,0,0,0,0,0,0,0,0,144,0,0,0,0,0,0,0,0,0,0,0,0,0,0,0,0,0,0,0,0,144,0,0,0,0]
[37,"Griffith, Patrick","M","Vale Royal",15.9,42,"00:02:45.600",67,3.17,{"$f":"IF(I43=\"NJ\",0,IF(I43<'Scoring Tables'!$S$4,0,VLOOKUP(I43,T_Long,11,TRUE)))","v":43},16.7,{"$f":"IF(K43=\"NT\",0,IF(K43<'Scoring Tables'!$X$14,0,VLOOKUP(K43,T_Javlin,6,TRUE)))","v":51},{"$f":"IFERROR((LARGE((F43,H43),1)+J43+L43),0)","v":161},"4B",{"$f":"IF(M43<15,0,HLOOKUP(M43,T_U11B_3_Events,3))","v":"5*"},440,null,440,2,{"$f":"RANK(M43,OFFSET($BC$6,0,AC43,64,1))","v":1},1,0,"",440161,1,44016143,4,{"$f":"IF(C43=\"M\",D43,\"\")","v":"Vale Royal"},17,"B",null,null,161,0,0,0,0,0,0,0,0,0,0,0,0,0,0,0,0,0,0,0,0,0,0,0,0,0,0,0,0,0,0,0,0,0,0,0,0,0,0,161,0,0,0,0,0,0,0,0,0,0,0,0,0,0,0,0,0,0,0,0,161,0,0,0,0]
[38,"Haffenden, Peter","M","Vale Royal",15.1,51,null,0,3.17,{"$f":"IF(I44=\"NJ\",0,IF(I44<'Scoring Tables'!$S$4,0,VLOOKUP(I44,T_Long,11,TRUE)))","v":43},11.73,{"$f":"IF(K44=\"NT\",0,IF(K44<'Scoring Tables'!$X$14,0,VLOOKUP(K44,T_Javlin,6,TRUE)))","v":31},{"$f":"IFERROR((LARGE((F44,H44),1)+J44+L44),0)","v":125},"12B",{"$f":"IF(M44<15,0,HLOOKUP(M44,T_U11B_3_Events,3))","v":"4*"},0,null,364,7,{"$f":"RANK(M44,OFFSET($BC$6,0,AC44,64,1))","v":4},5,0,"",0,0,36412544,20,{"$f":"IF(C44=\"M\",D44,\"\")","v":"Vale Royal"},17,"B",null,null,125,0,0,0,0,0,0,0,0,0,0,0,0,0,0,0,0,0,0,0,0,0,0,0,0,0,0,0,0,0,0,0,0,0,0,0,0,0,0,125,0,0,0,0,0,0,0,0,0,0,0,0,0,0,0,0,0,0,0,0,125,0,0,0,0]
[39,"Johnson, Harry","M","Vale Royal",15.5,46,null,0,2.94,{"$f":"IF(I45=\"NJ\",0,IF(I45<'Scoring Tables'!$S$4,0,VLOOKUP(I45,T_Long,11,TRUE)))","v":36},10.15,{"$f":"IF(K45=\"NT\",0,IF(K45<'Scoring Tables'!$X$14,0,VLOOKUP(K45,T_Javlin,6,TRUE)))","v":25},{"$f":"IFERROR((LARGE((F45,H45),1)+J45+L45),0)","v":107},"15B",null,0,null,0,0,{"$f":"RANK(M45,OFFSET($AH$6,0,AC45,64,1))","v":{"$error":"#N/A"}},7,0,"",0,0,0,0,null,17,"B",null,null,107,0,0,0,0,0,0,0,0,0,0,0,0,0,0,0,0,0,0,0,0,0,0,0,0,0,0,0,0,0,0,0,0,0,0,0,0,0,0,107,0,0,0,0,0,0,0,0,0,0,0,0,0,0,0,0,0,0,0,0,107,0,0,0,0]
[40,"Thorn, Ben","M","Vale Royal",15.8,43,null,0,3.01,{"$f":"IF(I46=\"NJ\",0,IF(I46<'Scoring Tables'!$S$4,0,VLOOKUP(I46,T_Long,11,TRUE)))","v":38},17.329999999999998,{"$f":"IF(K46=\"NT\",0,IF(K46<'Scoring Tables'!$X$14,0,VLOOKUP(K46,T_Javlin,6,TRUE)))","v":54},{"$f":"IFERROR((LARGE((F46,H46),1)+J46+L46),0)","v":135},"10B",{"$f":"IF(M46<15,0,HLOOKUP(M46,T_U11B_3_Events,3))","v":"4*"},0,null,440,2,{"$f":"RANK(M46,OFFSET($AH$6,0,AC46,64,1))","v":{"$error":"#N/A"}},3,0,"",0,0,44013546,6,{"$f":"IF(C46=\"F\",D46,\"\")","v":""},17,"B",null,null,135,0,0,0,0,0,0,0,0,0,0,0,0,0,0,0,0,0,0,0,0,0,0,0,0,0,0,0,0,0,0,0,0,0,0,0,0,0,0,135,0,0,0,0,0,0,0,0,0,0,0,0,0,0,0,0,0,0,0,0,135,0,0,0,0]
[41,"Bugg, Harry","M","West Cheshire",16.5,36,"00:03:03.200",58,2.8,{"$f":"IF(I47=\"NJ\",0,IF(I47<'Scoring Tables'!$S$4,0,VLOOKUP(I47,T_Long,11,TRUE)))","v":31},10.19,{"$f":"IF(K47=\"NT\",0,IF(K47<'Scoring Tables'!$X$14,0,VLOOKUP(K47,T_Javlin,6,TRUE)))","v":25},{"$f":"IFERROR((LARGE((F47,H47),1)+J47+L47),0)","v":114},"13B","3*",0,null,337,{"$f":"IFERROR(IF(R47>0,RANK(R47,$BY$85:$CS$87),0),0)","v":8},{"$f":"RANK(M47,OFFSET($AH$6,0,AC47,64,1))","v":{"$error":"#N/A"}},8,0,"",0,0,33711447,23,{"$f":"IF(C47=\"F\",D47,\"\")","v":""},19,"B",null,null,114,0,0,0,0,0,0,0,0,0,0,0,0,0,0,0,0,0,0,0,0,0,0,0,0,0,0,0,0,0,0,0,0,0,0,0,0,0,0,0,0,114,0,0,0,0,0,0,0,0,0,0,0,0,0,0,0,0,0,0,0,0,114,0,0,null,{"$f":"R47+2","v":339}]
[42,"Grinter, Zac","M","West Cheshire",15.5,46,"00:03:09.800",55,3.32,{"$f":"IF(I48=\"NJ\",0,IF(I48<'Scoring Tables'!$S$4,0,VLOOKUP(I48,T_Long,11,TRUE)))","v":48},14.25,{"$f":"IF(K48=\"NT\",0,IF(K48<'Scoring Tables'!$X$14,0,VLOOKUP(K48,T_Javlin,6,TRUE)))","v":42},{"$f":"IFERROR((LARGE((F48,H48),1)+J48+L48),0)","v":145},"7B","4*",432,null,432,{"$f":"IF(R48>0,RANK(R48,$BY$85:$CS$87),0)","v":3},{"$f":"RANK(M48,OFFSET($BC$6,0,AC48,64,1))","v":2},2,0,"",432145,4,43214548,8,{"$f":"IF(C48=\"M\",D48,\"\")","v":"West Cheshire"},19,"B",null,null,145,0,0,0,0,0,0,0,0,0,0,0,0,0,0,0,0,0,0,0,0,0,0,0,0,0,0,0,0,0,0,0,0,0,0,0,0,0,0,0,0,145,0,0,0,0,0,0,0,0,0,0,0,0,0,0,0,0,0,0,0,0,145,0,0]
[43,"Onomerike, Uzezi","M","West Cheshire",14.7,59,"00:03:32.200",43,3.4,{"$f":"IF(I49=\"NJ\",0,IF(I49<'Scoring Tables'!$S$4,0,VLOOKUP(I49,T_Long,11,TRUE)))","v":51},12.88,{"$f":"IF(K49=\"NT\",0,IF(K49<'Scoring Tables'!$X$14,0,VLOOKUP(K49,T_Javlin,6,TRUE)))","v":36},{"$f":"IFERROR((LARGE((F49,H49),1)+J49+L49),0)","v":146},"6B","4*",0,null,432,{"$f":"IF(R49>0,RANK(R49,$BY$85:$CS$87),0)","v":3},{"$f":"RANK(M49,OFFSET($AH$6,0,AC49,64,1))","v":{"$error":"#N/A"}},1,0,"",0,0,43214649,7,{"$f":"IF(C49=\"F\",D49,\"\")","v":""},19,"B",null,null,146,0,0,0,0,0,0,0,0,0,0,0,0,0,0,0,0,0,0,0,0,0,0,0,0,0,0,0,0,0,0,0,0,0,0,0,0,0,0,0,0,146,0,0,0,0,0,0,0,0,0,0,0,0,0,0,0,0,0,0,0,0,146,0,0]
[44,"Shakespeare-Wetton, Harley","M","West Cheshire",15.9,42,"00:03:01.400",59,3.11,{"$f":"IF(I50=\"NJ\",0,IF(I50<'Scoring Tables'!$S$4,0,VLOOKUP(I50,T_Long,11,TRUE)))","v":41},14.15,{"$f":"IF(K50=\"NT\",0,IF(K50<'Scoring Tables'!$X$14,0,VLOOKUP(K50,T_Javlin,6,TRUE)))","v":41},{"$f":"IFERROR((LARGE((F50,H50),1)+J50+L50),0)","v":141},"9B","4*",432,null,432,{"$f":"IF(R50>0,RANK(R50,$BY$85:$CS$87),0)","v":3},{"$f":"RANK(M50,OFFSET($BC$6,0,AC50,64,1))","v":3},3,0,"",432141,5,43214150,9,{"$f":"IF(C50=\"M\",D50,\"\")","v":"West Cheshire"},19,"B",null,null,141,0,0,0,0,0,0,0,0,0,0,0,0,0,0,0,0,0,0,0,0,0,0,0,0,0,0,0,0,0,0,0,0,0,0,0,0,0,0,0,0,141,0,0,0,0,0,0,0,0,0,0,0,0,0,0,0,0,0,0,0,0,141,0,0]
[null,null,null,null,null,{"$f":"IF(E51=\"DNF\",0,IF(E51=0,0,IF(E51<=14,VLOOKUP(E51,T_100m,15,TRUE),IF(E51<=15.2,VLOOKUP(E51,T_100m,15,TRUE),IF(E51<=21,VLOOKUP(E51-0.01,T_100m,15,TRUE)-1,0)))))","v":0},null,{"$f":"IF(G51=\"DNF\",0,IF(G51=0,0,VLOOKUP(G51,T_800m,11,TRUE)-1))","v":0},null,{"$f":"IF(I51=\"NJ\",0,IF(I51<'Scoring Tables'!$S$4,0,VLOOKUP(I51,T_Long,11,TRUE)))","v":0},null,{"$f":"IF(K51=\"NT\",0,IF(K51<'Scoring Tables'!$X$14,0,VLOOKUP(K51,T_Javlin,6,TRUE)))","v":0},{"$f":"IFERROR((LARGE((F51,H51),1)+J51+L51),0)","v":0},{"$f":"IF(M51=0,\"\",IF(C51=\"M\",(RANK(M51,AG$7:AG$97)&\"B\"),RANK(M51,AH$7:AH$95)&\"G\"))","v":""},0,{"$f":"IFERROR(IF(AD51=\"G\",OFFSET($AH$84,VLOOKUP(T51,$AB$94:$AC$105,2,0),AC51,1,1),IF(AD51=\"B\",OFFSET($BC$84,VLOOKUP(T51,$AB$94:$AC$105,2,0),AC51,1,1),0)),0)","v":0},{"$f":"IF(AD51=\"G\",IF(P51>0,CONCATENATE(RANK(P51,$AI$85:$BC$88),\"G\"),0),IF(AD51=\"B\",IF(P51>0,CONCATENATE(RANK(P51,$BD$85:$BX$88),\"B\"),0),0))","v":0},{"$f":"IFERROR(OFFSET($BX$84,VLOOKUP(U51,$AB$94:$AC$105,2,0),AC51,1,1),0)","v":0},{"$f":"IF(R51>0,RANK(R51,$BY$85:$CS$87),0)","v":0},{"$f":"RANK(M51,OFFSET($AH$6,0,AC51,64,1))","v":{"$error":"#N/A"}},{"$f":"RANK(M51,OFFSET($BX$6,0,AC51,64,1))","v":{"$error":"#N/A"}},{"$f":"IFERROR(IF(Q51=0,0,IF(C51=\"F\",P51*1000+M51,0)),0)","v":0},{"$f":"IF(AND(P51>0,C51=\"F\"), RANK(V51,$V$7:$V$68),\"\")","v":""},{"$f":"IFERROR(IF(P51=0,0,IF(C51=\"M\",P51*1000+M51,0)),0)","v":0},{"$f":"IFERROR(IF(AND(P51>0,C51=\"M\"), RANK(X51,$X$7:$X$68),0),0)","v":0},{"$f":"IFERROR(IF(R51>1,R51*100000+M51*100+ROW(),0),0)","v":0},{"$f":"IFERROR(IF(R51>0, RANK(Z51,$Z$7:$Z$52),0),0)","v":0},null,{"$f":"VLOOKUP(D51,ClubIx,2,0)","v":{"$error":"#N/A"}},{"$f":"IF(C51=\"M\",\"B\",\"G\")","v":"G"},null,null,{"$f":"IF(C51=\"M\",M51,0)","v":0},{"$f":"IF(C51=\"F\",M51,0)","v":0},{"$f":"IF($D51=AI$1,$AH51,0)","v":0},0,0,0,0,0,0,0,0,0,{"$f":"IF($D51=AS$1,$AH51,0)","v":0},0,0,0,0,0,0,0,0,0,0,{"$f":"IF($D51=BD$1,$AG51,0)","v":0},0,0,0,0,0,0,0,0,0,{"$f":"IF($D51=BN$1,$AG51,0)","v":0},0,0,0,0,0,0,0,0,0,0,{"$f":"AI51+BD51","v":0},{"$f":"AJ51+BE51","v":0},{"$f":"AK51+BF51","v":0},{"$f":"AL51+BG51","v":0},{"$f":"AM51+BH51","v":0},{"$f":"AN51+BI51","v":0},{"$f":"AO51+BJ51","v":0},{"$f":"AP51+BK51","v":0},{"$f":"AQ51+BL51","v":0},{"$f":"AR51+BM51","v":0},{"$f":"AS51+BN51","v":0},{"$f":"AT51+BO51","v":0},{"$f":"AU51+BP51","v":0},{"$f":"AV51+BQ51","v":0},{"$f":"AW51+BR51","v":0},{"$f":"AX51+BS51","v":0},{"$f":"AY51+BT51","v":0},{"$f":"AZ51+BU51","v":0},{"$f":"BA51+BV51","v":0},{"$f":"BB51+BW51","v":0},{"$f":"BC51+BX51","v":0}]
[null,null,null,null,null,0,null,0,null,{"$f":"IF(I52=\"NJ\",0,IF(I52<'Scoring Tables'!$S$4,0,VLOOKUP(I52,T_Long,11,TRUE)))","v":0},null,{"$f":"IF(K52=\"NT\",0,IF(K52<'Scoring Tables'!$X$14,0,VLOOKUP(K52,T_Javlin,6,TRUE)))","v":0},{"$f":"IFERROR((LARGE((F52,H52),1)+J52+L52),0)","v":0},"",{"$f":"IF(M52<15,\"\",HLOOKUP(M52,T_U11G_3_Events,3))","v":""},0,0,0,{"$f":"IF(R52>0,RANK(R52,$BY$85:$CS$87),\"\")","v":""},{"$f":"IF(A52=\"F\",B52,\"\")","v":""},{"$f":"IF(B52=\"F\",C52,\"\")","v":""},0,"",0,0,0,0,{"$f":"IF(C52=\"F\",D52,\"\")","v":""},null,"G",null,null,0,0,0,0,0,0,0,0,0,0,0,0,0,0,0,0,0,0,0,0,0,0,0,0,0,0,0,0,0,0,0,0,0,0,0,0,0,0,0,0,0,0,0,0,0,0,0,0,0,0,0,0,0,0,0,0,0,0,0,0,0,0,0,0,0]
[null,null,null,null,null,0,null,0,null,{"$f":"IF(I53=\"NJ\",0,IF(I53<'Scoring Tables'!$S$4,0,VLOOKUP(I53,T_Long,11,TRUE)))","v":0},null,{"$f":"IF(K53=\"NT\",0,IF(K53<'Scoring Tables'!$X$14,0,VLOOKUP(K53,T_Javlin,6,TRUE)))","v":0},{"$f":"IFERROR((LARGE((F53,H53),1)+J53+L53),0)","v":0},"","",0,0,0,"",null,null,0,"",0,0,0,0,null,null,"G",null,null,0,0,0,0,0,0,0,0,0,0,0,0,0,0,0,0,0,0,0,0,0,0,0,0,0,0,0,0,0,0,0,0,0,0,0,0,0,0,0,0,0,0,0,0,0,0,0,0,0,0,0,0,0,0,0,0,0,0,0,0,0,0,0,0,0]
[null,null,null,null,null,0,null,0,null,{"$f":"IF(I54=\"NJ\",0,IF(I54<'Scoring Tables'!$S$4,0,VLOOKUP(I54,T_Long,11,TRUE)))","v":0},null,{"$f":"IF(K54=\"NT\",0,IF(K54<'Scoring Tables'!$X$14,0,VLOOKUP(K54,T_Javlin,6,TRUE)))","v":0},{"$f":"IFERROR((LARGE((F54,H54),1)+J54+L54),0)","v":0},"","",0,0,0,"",null,null,0,"",0,0,0,0,null,null,"G",null,null,0,0,0,0,0,0,0,0,0,0,0,0,0,0,0,0,0,0,0,0,0,0,0,0,0,0,0,0,0,0,0,0,0,0,0,0,0,0,0,0,0,0,0,0,0,0,0,0,0,0,0,0,0,0,0,0,0,0,0,0,0,0,0,0,0]
[null,null,null,null,null,0,null,0,null,{"$f":"IF(I55=\"NJ\",0,IF(I55<'Scoring Tables'!$S$4,0,VLOOKUP(I55,T_Long,11,TRUE)))","v":0},null,{"$f":"IF(K55=\"NT\",0,IF(K55<'Scoring Tables'!$X$14,0,VLOOKUP(K55,T_Javlin,6,TRUE)))","v":0},{"$f":"IFERROR((LARGE((F55,H55),1)+J55+L55),0)","v":0},"","",0,0,0,"",null,null,0,"",0,0,0,0,null,null,"G",null,null,0,0,0,0,0,0,0,0,0,0,0,0,0,0,0,0,0,0,0,0,0,0,0,0,0,0,0,0,0,0,0,0,0,0,0,0,0,0,0,0,0,0,0,0,0,0,0,0,0,0,0,0,0,0,0,0,0,0,0,0,0,0,0,0,0]
[null,null,null,null,null,0,null,0,null,{"$f":"IF(I56=\"NJ\",0,IF(I56<'Scoring Tables'!$S$4,0,VLOOKUP(I56,T_Long,11,TRUE)))","v":0},null,{"$f":"IF(K56=\"NT\",0,IF(K56<'Scoring Tables'!$X$14,0,VLOOKUP(K56,T_Javlin,6,TRUE)))","v":0},{"$f":"IFERROR((LARGE((F56,H56),1)+J56+L56),0)","v":0},"","",0,0,0,"",null,null,0,"",0,0,0,0,null,null,"G",null,null,0,0,0,0,0,0,0,0,0,0,0,0,0,0,0,0,0,0,0,0,0,0,0,0,0,0,0,0,0,0,0,0,0,0,0,0,0,0,0,0,0,0,0,0,0,0,0,0,0,0,0,0,0,0,0,0,0,0,0,0,0,0,0,0,0]
[null,null,null,null,null,0,null,0,null,{"$f":"IF(I57=\"NJ\",0,IF(I57<'Scoring Tables'!$S$4,0,VLOOKUP(I57,T_Long,11,TRUE)))","v":0},null,{"$f":"IF(K57=\"NT\",0,IF(K57<'Scoring Tables'!$X$14,0,VLOOKUP(K57,T_Javlin,6,TRUE)))","v":0},{"$f":"IFERROR((LARGE((F57,H57),1)+J57+L57),0)","v":0},"","",0,0,0,"",null,null,0,"",0,0,0,0,null,null,"G",null,null,0,0,{"$f":"IF($D57=AI$1,$AH57,0)","v":0},0,0,0,0,0,0,0,0,0,{"$f":"IF($D57=AS$1,$AH57,0)","v":0},0,0,0,0,0,0,0,0,0,0,{"$f":"IF($D57=BD$1,$AG57,0)","v":0},0,0,0,0,0,0,0,0,0,{"$f":"IF($D57=BN$1,$AG57,0)","v":0},0,0,0,0,0,0,0,0,0,0,0,0,0,0,0,0,0,0,0,0,0,0,0,0,0,0,0,0,0,0,0]
[null,null,null,null,null,0,null,0,null,{"$f":"IF(I58=\"NJ\",0,IF(I58<'Scoring Tables'!$S$4,0,VLOOKUP(I58,T_Long,11,TRUE)))","v":0},null,{"$f":"IF(K58=\"NT\",0,IF(K58<'Scoring Tables'!$X$14,0,VLOOKUP(K58,T_Javlin,6,TRUE)))","v":0},{"$f":"IFERROR((LARGE((F58,H58),1)+J58+L58),0)","v":0},"","",0,0,0,"",null,null,0,"",0,0,0,0,null,null,"G",null,null,0,0,0,0,0,0,0,0,0,0,0,0,0,0,0,0,0,0,0,0,0,0,0,0,0,0,0,0,0,0,0,0,0,0,0,0,0,0,0,0,0,0,0,0,0,0,0,0,0,0,0,0,0,0,0,0,0,0,0,0,0,0,0,0,0]
[null,null,null,null,null,0,null,0,null,{"$f":"IF(I59=\"NJ\",0,IF(I59<'Scoring Tables'!$S$4,0,VLOOKUP(I59,T_Long,11,TRUE)))","v":0},null,{"$f":"IF(K59=\"NT\",0,IF(K59<'Scoring Tables'!$X$14,0,VLOOKUP(K59,T_Javlin,6,TRUE)))","v":0},{"$f":"IFERROR((LARGE((F59,H59),1)+J59+L59),0)","v":0},"","",0,0,0,"",null,null,0,"",0,0,0,0,null,null,"G",null,null,0,0,0,0,0,0,0,0,0,0,0,0,0,0,0,0,0,0,0,0,0,0,0,0,0,0,0,0,0,0,0,0,0,0,0,0,0,0,0,0,0,0,0,0,0,0,0,0,0,0,0,0,0,0,0,0,0,0,0,0,0,0,0,0,0]
[null,null,null,null,null,0,null,0,null,{"$f":"IF(I60=\"NJ\",0,IF(I60<'Scoring Tables'!$S$4,0,VLOOKUP(I60,T_Long,11,TRUE)))","v":0},null,{"$f":"IF(K60=\"NT\",0,IF(K60<'Scoring Tables'!$X$14,0,VLOOKUP(K60,T_Javlin,6,TRUE)))","v":0},{"$f":"IFERROR((LARGE((F60,H60),1)+J60+L60),0)","v":0},"","",0,0,0,"",null,null,0,"",0,0,0,0,null,null,"G",null,null,0,0,0,0,0,0,0,0,0,0,0,0,0,0,0,0,0,0,0,0,0,0,0,0,0,0,0,0,0,0,0,0,0,0,0,0,0,0,0,0,0,0,0,0,0,0,0,0,0,0,0,0,0,0,0,0,0,0,0,0,0,0,0,0,0]
[null,null,null,null,null,0,null,0,null,{"$f":"IF(I61=\"NJ\",0,IF(I61<'Scoring Tables'!$S$4,0,VLOOKUP(I61,T_Long,11,TRUE)))","v":0},null,{"$f":"IF(K61=\"NT\",0,IF(K61<'Scoring Tables'!$X$14,0,VLOOKUP(K61,T_Javlin,6,TRUE)))","v":0},{"$f":"IFERROR((LARGE((F61,H61),1)+J61+L61),0)","v":0},"","",0,0,0,"",null,null,0,"",0,0,0,0,null,null,"G",null,null,0,0,0,0,0,0,0,0,0,0,0,0,0,0,0,0,0,0,0,0,0,0,0,0,0,0,0,0,0,0,0,0,0,0,0,0,0,0,0,0,0,0,0,0,0,0,0,0,0,0,0,0,0,0,0,0,0,0,0,0,0,0,0,0,0]
[null,null,null,null,null,0,null,0,null,{"$f":"IF(I62=\"NJ\",0,IF(I62<'Scoring Tables'!$S$4,0,VLOOKUP(I62,T_Long,11,TRUE)))","v":0},null,{"$f":"IF(K62=\"NT\",0,IF(K62<'Scoring Tables'!$X$14,0,VLOOKUP(K62,T_Javlin,6,TRUE)))","v":0},{"$f":"IFERROR((LARGE((F62,H62),1)+J62+L62),0)","v":0},"","",0,0,0,"",null,null,0,"",0,0,0,0,null,null,"G",null,null,0,0,0,0,0,0,0,0,0,0,0,0,0,0,0,0,0,0,0,0,0,0,0,0,0,0,0,0,0,0,0,0,0,0,0,0,0,0,0,0,0,0,0,0,0,0,0,0,0,0,0,0,0,0,0,0,0,0,0,0,0,0,0,0,0]
[null,null,null,null,null,0,null,0,null,{"$f":"IF(I63=\"NJ\",0,IF(I63<'Scoring Tables'!$S$4,0,VLOOKUP(I63,T_Long,11,TRUE)))","v":0},null,{"$f":"IF(K63=\"NT\",0,IF(K63<'Scoring Tables'!$X$14,0,VLOOKUP(K63,T_Javlin,6,TRUE)))","v":0},{"$f":"IFERROR((LARGE((F63,H63),1)+J63+L63),0)","v":0},"","",0,0,0,"",null,null,0,"",0,0,0,0,null,null,"G",null,null,0,0,0,0,0,0,0,0,0,0,0,0,0,0,0,0,0,0,0,0,0,0,0,0,0,0,0,0,0,0,0,0,0,0,0,0,0,0,0,0,0,0,0,0,0,0,0,0,0,0,0,0,0,0,0,0,0,0,0,0,0,0,0,0,0]
[null,null,null,null,null,0,null,0,null,{"$f":"IF(I64=\"NJ\",0,IF(I64<'Scoring Tables'!$S$4,0,VLOOKUP(I64,T_Long,11,TRUE)))","v":0},null,{"$f":"IF(K64=\"NT\",0,IF(K64<'Scoring Tables'!$X$14,0,VLOOKUP(K64,T_Javlin,6,TRUE)))","v":0},{"$f":"IFERROR((LARGE((F64,H64),1)+J64+L64),0)","v":0},"","",0,0,0,"",null,null,0,"",0,0,0,0,null,null,"G",null,null,0,0,0,0,0,0,0,0,0,0,0,0,0,0,0,0,0,0,0,0,0,0,0,0,0,0,0,0,0,0,0,0,0,0,0,0,0,0,0,0,0,0,0,0,0,0,0,0,0,0,0,0,0,0,0,0,0,0,0,0,0,0,0,0,0]
[null,null,null,null,null,0,null,0,null,{"$f":"IF(I65=\"NJ\",0,IF(I65<'Scoring Tables'!$S$4,0,VLOOKUP(I65,T_Long,11,TRUE)))","v":0},null,{"$f":"IF(K65=\"NT\",0,IF(K65<'Scoring Tables'!$X$14,0,VLOOKUP(K65,T_Javlin,6,TRUE)))","v":0},{"$f":"IFERROR((LARGE((F65,H65),1)+J65+L65),0)","v":0},"","",0,0,0,"",null,null,0,"",0,0,0,0,null,null,"G",null,null,0,0,0,0,0,0,0,0,0,0,0,0,0,0,0,0,0,0,0,0,0,0,0,0,0,0,0,0,0,0,0,0,0,0,0,0,0,0,0,0,0,0,0,0,0,0,0,0,0,0,0,0,0,0,0,0,0,0,0,0,0,0,0,0,0]
[null,null,null,null,null,0,null,0,null,{"$f":"IF(I66=\"NJ\",0,IF(I66<'Scoring Tables'!$S$4,0,VLOOKUP(I66,T_Long,11,TRUE)))","v":0},null,{"$f":"IF(K66=\"NT\",0,IF(K66<'Scoring Tables'!$X$14,0,VLOOKUP(K66,T_Javlin,6,TRUE)))","v":0},{"$f":"IFERROR((LARGE((F66,H66),1)+J66+L66),0)","v":0},"","",0,0,0,"",null,null,0,"",0,0,0,0,null,null,"G",null,null,0,0,0,0,0,0,0,0,0,0,0,0,0,0,0,0,0,0,0,0,0,0,0,0,0,0,0,0,0,0,0,0,0,0,0,0,0,0,0,0,0,0,0,0,0,0,0,0,0,0,0,0,0,0,0,0,0,0,0,0,0,0,0,0,0]
[null,null,null,null,null,0,null,0,null,{"$f":"IF(I67=\"NJ\",0,IF(I67<'Scoring Tables'!$S$4,0,VLOOKUP(I67,T_Long,11,TRUE)))","v":0},null,{"$f":"IF(K67=\"NT\",0,IF(K67<'Scoring Tables'!$X$14,0,VLOOKUP(K67,T_Javlin,6,TRUE)))","v":0},{"$f":"IFERROR((LARGE((F67,H67),1)+J67+L67),0)","v":0},"","",0,0,0,"",null,null,0,"",0,0,0,0,null,null,"G",null,null,0,0,0,0,0,0,0,0,0,0,0,0,0,0,0,0,0,0,0,0,0,0,0,0,0,0,0,0,0,0,0,0,0,0,0,0,0,0,0,0,0,0,0,0,0,0,0,0,0,0,0,0,0,0,0,0,0,0,0,0,0,0,0,0,0]
[null,null,null,null,null,0,null,0,null,{"$f":"IF(I68=\"NJ\",0,IF(I68<'Scoring Tables'!$S$4,0,VLOOKUP(I68,T_Long,11,TRUE)))","v":0},null,{"$f":"IF(K68=\"NT\",0,IF(K68<'Scoring Tables'!$X$14,0,VLOOKUP(K68,T_Javlin,6,TRUE)))","v":0},{"$f":"IFERROR((LARGE((F68,H68),1)+J68+L68),0)","v":0},"","",0,0,0,"",null,null,0,"",0,0,0,0,null,null,"G",null,null,0,0,0,0,0,0,0,0,0,0,0,0,0,0,0,0,0,0,0,0,0,0,0,0,0,0,0,0,0,0,0,0,0,0,0,0,0,0,0,0,0,0,0,0,0,0,0,0,0,0,0,0,0,0,0,0,0,0,0,0,0,0,0,0,0]
[{"$f":"SUMPRODUCT((C7:C68=\"F\")*(M7:M68>0))","v":19},"Athletes - Girls",null,null,null,{"$f":"IF(E69=\"DNF\",0,IF(E69=0,0,IF(E69<=14,VLOOKUP(E69,T_100m,15,TRUE),IF(E69<=15.2,VLOOKUP(E69,T_100m,15,TRUE),IF(E69<=21,VLOOKUP(E69-0.01,T_100m,15,TRUE)-1,0)))))","v":0},null,{"$f":"IF(G69=\"DNF\",0,IF(G69=0,0,VLOOKUP(G69,T_800m,11,TRUE)-1))","v":0},null,{"$f":"IF(I69=\"NJ\",0,IF(I69<'Scoring Tables'!$S$4,0,VLOOKUP(I69,T_Long,11,TRUE)))","v":0},null,{"$f":"IF(K69=\"NT\",0,IF(K69<'Scoring Tables'!$X$14,0,VLOOKUP(K69,T_Javlin,6,TRUE)))","v":0},{"$f":"(LARGE((F69,H69),1)+J69+L69)","v":0},{"$f":"IF(M69=0,\"\",IF(C69=\"M\",(RANK(M69,AG$7:AG$97)&\"B\"),RANK(M69,AH$7:AH$95)&\"G\"))","v":""},{"$f":"IF(M69<15,\"\",HLOOKUP(M69,T_U11G_3_Events,3))","v":""},null,null,null,null,null,null,null,null,{"$f":"IF(P69=0,0,IF(C69=\"M\",P69*1000+M69,0))","v":0},{"$f":"IFERROR(IF(AND(P69>0,C69=\"M\"), RANK(X69,$X$7:$X$68),0),0)","v":0},{"$f":"IF(R69>1,R69*1000+M69+ROW()/100,\"\")","v":""},null,null,null,null,null,null,{"$f":"IF(C69=\"M\",M69,0)","v":0},{"$f":"IF(C69=\"F\",M69,0)","v":0},null,null,null,null,null,null,null,null,null,null,null,null,null,null,null,null,null,null,null,null,null,{"$f":"IF($D69=BD$1,$M69,0)","v":0},0,0,0,0,0,0,0,0,0,{"$f":"IF($D69=BN$1,$M69,0)","v":0},0,0,0,0,0,0,0,0,0,0,{"$f":"AI69+BD69","v":0},{"$f":"AJ69+BE69","v":0},{"$f":"AK69+BF69","v":0},{"$f":"AL69+BG69","v":0},{"$f":"AM69+BH69","v":0},{"$f":"AN69+BI69","v":0},{"$f":"AO69+BJ69","v":0},{"$f":"AP69+BK69","v":0},{"$f":"AQ69+BL69","v":0},{"$f":"AR69+BM69","v":0},{"$f":"AS69+BN69","v":0},{"$f":"AT69+BO69","v":0},{"$f":"AU69+BP69","v":0},{"$f":"AV69+BQ69","v":0},{"$f":"AW69+BR69","v":0},{"$f":"AX69+BS69","v":0},{"$f":"AY69+BT69","v":0},{"$f":"AZ69+BU69","v":0},{"$f":"BA69+BV69","v":0},{"$f":"BB69+BW69","v":0},{"$f":"BC69+BX69","v":0}]
[{"$f":"SUMPRODUCT((C7:C68=\"M\")*(M7:M68>0))","v":19},"Athletes - Boys",null,null,null,0,null,0,null,{"$f":"IF(I70=\"NJ\",0,IF(I70<'Scoring Tables'!$S$4,0,VLOOKUP(I70,T_Long,11,TRUE)))","v":0},null,{"$f":"IF(K70=\"NT\",0,IF(K70<'Scoring Tables'!$X$14,0,VLOOKUP(K70,T_Javlin,6,TRUE)))","v":0},{"$f":"(LARGE((F70,H70),1)+J70+L70)","v":0},"","",null,null,null,null,null,null,null,null,null,null,null,null,null,null,null,null,null,0,0,null,null,null,null,null,null,null,null,null,null,null,null,null,null,null,null,null,null,null,null,null,0,0,0,0,0,0,0,0,0,0,0,0,0,0,0,0,0,0,0,0,0,0,0,0,0,0,0,0,0,0,0,0,0,0,0,0,0,0,0,0,0,0]
[null,null,null,null,null,null,null,0,null,{"$f":"IF(I71=\"NJ\",0,IF(I71<'Scoring Tables'!$S$4,0,VLOOKUP(I71,T_Long,11,TRUE)))","v":0},null,null,null,null,null,null,null,null,null,null,null,null,null,null,null,null,null,null,null,null,1,"A Team",null,"Large (1)",{"$f":"LARGE(AI$7:AI$70,$AE71)","v":0},{"$f":"LARGE(AJ$7:AJ$70,1)","v":0},{"$f":"LARGE(AK$7:AK$70,$AE71)","v":156},0,0,104,120,0,152,0,130,0,{"$f":"LARGE(AU$7:AU$70,$AE71)","v":103},0,83,0,129,0,139,0,0,0,{"$f":"LARGE(BE$7:BE$70,$AE71)","v":0},{"$f":"LARGE(BF$7:BF$70,$AE71)","v":189},0,0,0,103,0,147,0,163,{"$f":"LARGE(BO$7:BO$70,$AE71)","v":0},0,0,169,0,161,0,146,0,0,{"$f":"LARGE(BY$7:BY$70,$AE71)","v":0},0,189,0,0,104,120,0,152,0,{"$f":"LARGE(CI$7:CI$70,$AE71)","v":163},0,103,0,169,0,161,0,146,0,0]
[null,null,null,null,null,null,null,0,null,{"$f":"IF(I72=\"NJ\",0,IF(I72<'Scoring Tables'!$S$4,0,VLOOKUP(I72,T_Long,11,TRUE)))","v":0},null,null,null,null,null,null,null,null,null,null,null,null,null,null,null,null,null,null,null,null,2,null,null,"Large (2)",0,{"$f":"LARGE(AJ$7:AJ$70,2)","v":0},111,0,0,0,0,0,126,0,0,0,0,0,0,0,110,0,133,0,0,0,0,134,0,0,0,103,0,0,0,0,0,0,0,102,0,144,0,145,0,0,0,0,156,0,0,0,103,0,147,0,130,0,0,0,102,0,144,0,145,0,0]
[null,null,null,null,null,null,null,null,null,null,null,null,null,null,null,null,null,null,null,null,null,null,null,null,null,null,null,null,null,null,3,null,null,"Large (3)",0,{"$f":"LARGE(AJ$7:AJ$70,3)","v":0},0,0,0,0,0,0,98,0,0,0,0,0,0,0,102,0,128,0,0,0,0,113,0,0,0,0,0,0,0,0,0,0,0,99,0,135,0,141,0,0,0,0,134,0,0,0,103,0,126,0,0,0,0,0,99,0,135,0,141,0,0]
[null,null,null,null,null,null,null,null,null,null,null,null,null,null,null,null,null,null,null,null,null,null,null,null,null,null,null,{"$f":"(ROW()-73)*3 +1","v":4},{"$f":"(ROW()-73)*3 +2","v":5},{"$f":"(ROW()-73)*3 +3","v":6},4,"B Team",null,"Large (4)",0,{"$f":"LARGE(AJ$7:AJ$70,4)","v":0},0,0,0,0,0,0,92,0,0,0,0,0,0,0,0,0,122,0,0,0,0,0,0,0,0,0,0,0,0,0,0,0,0,0,0,125,0,114,0,0,0,0,113,0,0,0,0,0,98,0,0,0,0,0,83,0,129,0,139,0,0]
[null,null,null,null,null,null,null,null,null,null,null,null,null,null,null,null,null,null,null,null,null,null,null,null,null,null,null,7,8,9,5,null,null,"Large (5)",0,{"$f":"LARGE(AJ$7:AJ$70,5)","v":0},0,0,0,0,0,0,0,0,0,0,0,0,0,0,0,0,101,0,0,0,0,0,0,0,0,0,0,0,0,0,0,0,0,0,0,107,0,0,0,0,0,0,111,0,0,0,0,0,92,0,0,0,0,0,0,0,125,0,133,0,0]
[null,null,null,null,null,null,null,null,null,null,null,null,null,null,null,null,null,null,null,null,null,null,null,null,null,null,null,10,11,12,6,null,null,"Large (6)",0,{"$f":"LARGE(AJ$7:AJ$70,6)","v":0},0,0,0,0,0,0,0,0,0,0,0,0,0,0,0,0,0,0,0,0,0,0,0,0,0,0,0,0,0,0,0,0,0,0,0,0,0,0,0,0,0,0,0,0,0,0,0,0,0,0,0,0,0,0,0,0,110,0,128,0,0]
[null,null,null,null,null,null,null,null,null,null,null,null,null,null,null,null,null,null,null,null,null,null,null,null,null,null,null,13,14,15,7,"C Team",null,"Large (7)",0,null,0,0,0,0,0,0,0,0,0,0,0,0,0,0,0,0,0,0,0,0,0,0,0,0,0,0,0,0,0,0,0,0,0,0,0,0,0,0,0,0,0,0,0,0,0,0,0,0,0,0,0,0,0,0,0,0,107,0,122,0,0]
[null,null,null,null,null,null,null,null,null,null,null,null,null,null,null,null,null,null,null,null,null,null,null,null,null,null,null,16,17,18,8,null,null,"Large (8)",0,null,0,0,0,0,0,0,0,0,0,0,0,0,0,0,0,0,0,0,0,0,0,0,0,0,0,0,0,0,0,0,0,0,0,0,0,0,0,0,0,0,0,0,0,0,0,0,0,0,0,0,0,0,0,0,0,0,102,0,114,0,0]
[null,null,null,null,null,null,null,null,null,null,null,null,null,null,null,null,null,null,null,null,null,null,null,null,null,null,null,19,20,21,9,null,null,"Large (9)",0,null,0,0,0,0,0,0,0,0,0,0,0,0,0,0,0,0,0,0,0,0,0,0,0,0,0,0,0,0,0,0,0,0,0,0,0,0,0,0,0,0,0,0,0,0,0,0,0,0,0,0,0,0,0,0,0,0,0,0,101,0,0]
[null,null,null,null,null,null,null,null,null,null,null,null,null,null,null,null,null,null,null,null,null,null,null,null,null,null,null,22,23,24,10,"D Team",null,"Large (10)",0,{"$f":"LARGE(AJ$7:AJ$70,8)","v":0},0,0,0,0,0,0,0,0,0,0,0,0,0,0,0,0,0,0,0,0,0,0,0,0,0,0,0,0,0,0,0,0,0,0,0,0,0,0,0,0,0,0,0,0,0,0,0,0,0,0,0,0,0,0,0,0,0,0,0,0,0]
[null,null,null,null,null,null,null,null,null,null,null,null,null,null,null,null,null,null,null,null,null,null,null,null,null,null,null,25,26,27,11,null,null,"Large (11)",0,{"$f":"LARGE(AJ$7:AJ$70,7)","v":0},0,0,0,0,0,0,0,0,0,0,0,0,0,0,0,0,0,0,0,0,0,0,0,0,0,0,0,0,0,0,0,0,0,0,0,0,0,0,0,0,0,0,0,0,0,0,0,0,0,0,0,0,0,0,0,0,0,0,0,0,0,{"$f":"SUM(BY84:CS84)","v":38}]
[null,null,null,null,null,null,null,null,null,null,null,null,null,null,null,null,null,null,null,null,null,null,null,null,null,null,null,28,29,30,12,null,null,"Large (12)",0,{"$f":"LARGE(AJ$7:AJ$70,9)","v":0},0,0,0,0,0,0,0,0,0,0,0,0,0,0,0,0,0,0,0,0,0,0,0,0,0,0,0,0,0,0,0,0,0,0,0,0,0,0,0,0,0,0,0,0,0,0,0,0,0,0,0,0,0,0,0,0,0,0,0,0,0]
[null,null,null,null,null,null,null,null,null,null,null,null,null,null,null,null,null,null,null,null,null,null,null,null,null,null,null,{"$f":"(ROW()-73)*3 +1","v":31},{"$f":"(ROW()-73)*3 +2","v":32},{"$f":"(ROW()-73)*3 +3","v":33},null,null,null,null,{"$f":"IF(COUNTIF(AI80:AI82,\">0\")>2,SUM(AI80:AI82),0)","v":0},0,0,0,0,0,0,0,0,0,0,0,0,0,0,0,0,0,0,0,0,{"$f":"SUM(BD80:BD82)","v":0},0,0,0,0,0,0,0,0,0,0,0,0,0,0,0,0,0,0,0,0,0,0,0,0,0,0,0,0,0,0,0,0,0,0,0,0,0,0,0,0,0]
["MIXED TEAMS",null,null,null,null,null,null,{"$f":"IF(G84=\"DNF\",0,IF(G84=0,0,VLOOKUP(G84,T_800m,11,TRUE)-1))","v":0},null,{"$f":"IF(I84=\"NJ\",0,IF(I84<'Scoring Tables'!$S$4,0,VLOOKUP(I84,T_Long,11,TRUE)))","v":0},null,null,null,null,null,"Total",null,"Team",null,null,null,null,null,null,null,null,null,{"$f":"(ROW()-73)*3 +1","v":34},{"$f":"(ROW()-73)*3 +2","v":35},{"$f":"(ROW()-73)*3 +3","v":36},null,null,null,"No in Team",{"$f":"COUNTIF(AI7:AI70,\">0\")","v":0},0,2,0,0,1,1,0,4,0,1,0,1,0,1,0,3,0,5,0,0,0,0,{"$f":"COUNTIF(BF7:BF70,\">0\")","v":3},0,0,0,2,0,1,0,1,{"$f":"COUNTIF(BO7:BO70,\">0\")","v":0},0,0,3,0,5,0,4,0,0,0,0,5,0,0,1,3,0,5,0,2,0,1,0,4,0,8,0,9,0,0]
[1,{"$f":"OFFSET($D$6,T85,0,1,1)","v":"Crewe & Nantwich"},{"$f":"IFERROR(VLOOKUP(R85,$AB$94:$AD$105,3,1),0)","v":" "},{"$f":"OFFSET($B$6,T85,0,1,1)","v":"Atkinson, Oliver"},{"$f":"OFFSET($M$6,T85,0,1,1)","v":189},null,{"$f":"OFFSET($B$6,U85,0,1,1)","v":"Wilding, Esther"},null,{"$f":"OFFSET($M$6,U85,0,1,1)","v":156},null,{"$f":"OFFSET($B$6,S85,0,1,1)","v":"Stokes, Thomas"},null,{"$f":"OFFSET($M$6,S85,0,1,1)","v":134},null,null,{"$f":"OFFSET($R$6,T85,0,1,1)","v":479},null,{"$f":"COUNTIF($B$85:B85,B85)","v":1},{"$f":"MATCH((ROW()-85)*3 +3,$AA$7:$AA$51,0)","v":25},{"$f":"MATCH((ROW()-85)*3 +1,$AA$7:$AA$51,0)","v":23},{"$f":"MATCH((ROW()-85)*3 +2,$AA$7:$AA$51,0)","v":2},null,null,null,null,null,null,null,null,null,null,"A Team",null,"Eligible Teams",{"$f":"IFERROR(IF(AI$84>=3,SUM(AI71:AI73),0),0)","v":0},{"$f":"IFERROR(IF(AJ$84>=3,SUM(AJ71:AJ73),0),0)","v":0},0,0,0,0,0,0,376,0,0,0,0,0,0,0,341,0,400,0,0,0,0,436,0,0,0,0,0,0,0,0,0,0,0,370,0,440,0,432,0,0,0,0,479,0,0,0,326,0,425,0,0,0,0,0,370,0,440,0,432,0,0]
[{"$f":"A85+1","v":2},"Vale Royal",{"$f":"IFERROR(VLOOKUP(R86,$AB$94:$AD$105,3,1),0)","v":" "},"Griffith, Patrick",161,null,"Carney, Dylan",null,144,null,"Thorn, Ben",null,135,null,null,440,null,{"$f":"COUNTIF($B$85:B86,B86)","v":1},{"$f":"MATCH((ROW()-85)*3 +3,$AA$7:$AA$51,0)","v":40},{"$f":"MATCH((ROW()-85)*3 +1,$AA$7:$AA$51,0)","v":37},{"$f":"MATCH((ROW()-85)*3 +2,$AA$7:$AA$51,0)","v":36},null,null,null,null,null,null,null,null,null,null,"B Team",null,"Eligible Teams",{"$f":"IFERROR(IF(AI$84>=6,SUM(AI$74:AI76),0),0)","v":0},{"$f":"IFERROR(IF(AJ$84>=6,SUM(AJ$74:AJ76),0),0)","v":0},{"$f":"IFERROR(IF(AK$84>=6,SUM(AK$74:AK76),0),0)","v":0},{"$f":"IFERROR(IF(AL$84>=6,SUM(AL$74:AL76),0),0)","v":0},{"$f":"IFERROR(IF(AM$84>=6,SUM(AM$74:AM76),0),0)","v":0},{"$f":"IFERROR(IF(AN$84>=6,SUM(AN$74:AN76),0),0)","v":0},{"$f":"IFERROR(IF(AO$84>=6,SUM(AO$74:AO76),0),0)","v":0},{"$f":"IFERROR(IF(AP$84>=6,SUM(AP$74:AP76),0),0)","v":0},{"$f":"IFERROR(IF(AQ$84>=6,SUM(AQ$74:AQ76),0),0)","v":0},{"$f":"IFERROR(IF(AR$84>=6,SUM(AR$74:AR76),0),0)","v":0},{"$f":"IFERROR(IF(AS$84>=6,SUM(AS$74:AS76),0),0)","v":0},{"$f":"IFERROR(IF(AT$84>=6,SUM(AT$74:AT76),0),0)","v":0},{"$f":"IFERROR(IF(AU$84>=6,SUM(AU$74:AU76),0),0)","v":0},{"$f":"IFERROR(IF(AV$84>=6,SUM(AV$74:AV76),0),0)","v":0},{"$f":"IFERROR(IF(AW$84>=6,SUM(AW$74:AW76),0),0)","v":0},{"$f":"IFERROR(IF(AX$84>=6,SUM(AX$74:AX76),0),0)","v":0},{"$f":"IFERROR(IF(AY$84>=6,SUM(AY$74:AY76),0),0)","v":0},{"$f":"IFERROR(IF(AZ$84>=6,SUM(AZ$74:AZ76),0),0)","v":0},{"$f":"IFERROR(IF(BA$84>=6,SUM(BA$74:BA76),0),0)","v":0},{"$f":"IFERROR(IF(BB$84>=6,SUM(BB$74:BB76),0),0)","v":0},{"$f":"IFERROR(IF(BC$84>=6,SUM(BC$74:BC76),0),0)","v":0},{"$f":"IFERROR(IF(BD$84>=6,SUM(BD$74:BD76),0),0)","v":0},{"$f":"IFERROR(IF(BE$84>=6,SUM(BE$74:BE76),0),0)","v":0},{"$f":"IFERROR(IF(BF$84>=6,SUM(BF$74:BF76),0),0)","v":0},{"$f":"IFERROR(IF(BG$84>=6,SUM(BG$74:BG76),0),0)","v":0},{"$f":"IFERROR(IF(BH$84>=6,SUM(BH$74:BH76),0),0)","v":0},{"$f":"IFERROR(IF(BI$84>=6,SUM(BI$74:BI76),0),0)","v":0},{"$f":"IFERROR(IF(BJ$84>=6,SUM(BJ$74:BJ76),0),0)","v":0},{"$f":"IFERROR(IF(BK$84>=6,SUM(BK$74:BK76),0),0)","v":0},{"$f":"IFERROR(IF(BL$84>=6,SUM(BL$74:BL76),0),0)","v":0},{"$f":"IFERROR(IF(BM$84>=6,SUM(BM$74:BM76),0),0)","v":0},{"$f":"IFERROR(IF(BN$84>=6,SUM(BN$74:BN76),0),0)","v":0},{"$f":"IFERROR(IF(BO$84>=6,SUM(BO$74:BO76),0),0)","v":0},{"$f":"IFERROR(IF(BP$84>=6,SUM(BP$74:BP76),0),0)","v":0},{"$f":"IFERROR(IF(BQ$84>=6,SUM(BQ$74:BQ76),0),0)","v":0},{"$f":"IFERROR(IF(BR$84>=6,SUM(BR$74:BR76),0),0)","v":0},{"$f":"IFERROR(IF(BS$84>=6,SUM(BS$74:BS76),0),0)","v":0},{"$f":"IFERROR(IF(BT$84>=6,SUM(BT$74:BT76),0),0)","v":0},{"$f":"IFERROR(IF(BU$84>=6,SUM(BU$74:BU76),0),0)","v":0},{"$f":"IFERROR(IF(BV$84>=6,SUM(BV$74:BV76),0),0)","v":0},{"$f":"IFERROR(IF(BW$84>=6,SUM(BW$74:BW76),0),0)","v":0},{"$f":"IFERROR(IF(BX$84>=6,SUM(BX$74:BX76),0),0)","v":0},{"$f":"IFERROR(IF(BY$84>=6,SUM(BY$74:BY76),0),0)","v":0},{"$f":"IFERROR(IF(BZ$84>=6,SUM(BZ$74:BZ76),0),0)","v":0},{"$f":"IFERROR(IF(CA$84>=6,SUM(CA$74:CA76),0),0)","v":0},{"$f":"IFERROR(IF(CB$84>=6,SUM(CB$74:CB76),0),0)","v":0},{"$f":"IFERROR(IF(CC$84>=6,SUM(CC$74:CC76),0),0)","v":0},{"$f":"IFERROR(IF(CD$84>=6,SUM(CD$74:CD76),0),0)","v":0},{"$f":"IFERROR(IF(CE$84>=6,SUM(CE$74:CE76),0),0)","v":0},{"$f":"IFERROR(IF(CF$84>=6,SUM(CF$74:CF76),0),0)","v":0},{"$f":"IFERROR(IF(CG$84>=6,SUM(CG$74:CG76),0),0)","v":0},{"$f":"IFERROR(IF(CH$84>=6,SUM(CH$74:CH76),0),0)","v":0},{"$f":"IFERROR(IF(CI$84>=6,SUM(CI$74:CI76),0),0)","v":0},{"$f":"IFERROR(IF(CJ$84>=6,SUM(CJ$74:CJ76),0),0)","v":0},{"$f":"IFERROR(IF(CK$84>=6,SUM(CK$74:CK76),0),0)","v":0},{"$f":"IFERROR(IF(CL$84>=6,SUM(CL$74:CL76),0),0)","v":0},{"$f":"IFERROR(IF(CM$84>=6,SUM(CM$74:CM76),0),0)","v":0},{"$f":"IFERROR(IF(CN$84>=6,SUM(CN$74:CN76),0),0)","v":0},{"$f":"IFERROR(IF(CO$84>=6,SUM(CO$74:CO76),0),0)","v":364},{"$f":"IFERROR(IF(CP$84>=6,SUM(CP$74:CP76),0),0)","v":0},{"$f":"IFERROR(IF(CQ$84>=6,SUM(CQ$74:CQ76),0),0)","v":400},{"$f":"IFERROR(IF(CR$84>=6,SUM(CR$74:CR76),0),0)","v":0},{"$f":"IFERROR(IF(CS$84>=6,SUM(CS$74:CS76),0),0)","v":0}]
[{"$f":"A86+1","v":3},"West Cheshire"," ","Onomerike, Uzezi",146,null,"Grinter, Zac",null,145,null,"Shakespeare-Wetton, Harley",null,141,null,null,432,null,{"$f":"COUNTIF($B$85:B87,B87)","v":1},44,43,42,null,null,null,null,null,null,null,null,null,null,"C Team",null,"Eligible Teams",{"$f":"IFERROR(IF(AI$84>=9,SUM(AI$77:AI79),0),0)","v":0},{"$f":"IFERROR(IF(AJ$84>=9,SUM(AJ$77:AJ79),0),0)","v":0},{"$f":"IFERROR(IF(AK$84>=9,SUM(AK$77:AK79),0),0)","v":0},{"$f":"IFERROR(IF(AL$84>=9,SUM(AL$77:AL79),0),0)","v":0},{"$f":"IFERROR(IF(AM$84>=9,SUM(AM$77:AM79),0),0)","v":0},{"$f":"IFERROR(IF(AN$84>=9,SUM(AN$77:AN79),0),0)","v":0},{"$f":"IFERROR(IF(AO$84>=9,SUM(AO$77:AO79),0),0)","v":0},{"$f":"IFERROR(IF(AP$84>=9,SUM(AP$77:AP79),0),0)","v":0},{"$f":"IFERROR(IF(AQ$84>=9,SUM(AQ$77:AQ79),0),0)","v":0},{"$f":"IFERROR(IF(AR$84>=9,SUM(AR$77:AR79),0),0)","v":0},{"$f":"IFERROR(IF(AS$84>=9,SUM(AS$77:AS79),0),0)","v":0},{"$f":"IFERROR(IF(AT$84>=9,SUM(AT$77:AT79),0),0)","v":0},{"$f":"IFERROR(IF(AU$84>=9,SUM(AU$77:AU79),0),0)","v":0},{"$f":"IFERROR(IF(AV$84>=9,SUM(AV$77:AV79),0),0)","v":0},{"$f":"IFERROR(IF(AW$84>=9,SUM(AW$77:AW79),0),0)","v":0},{"$f":"IFERROR(IF(AX$84>=9,SUM(AX$77:AX79),0),0)","v":0},{"$f":"IFERROR(IF(AY$84>=9,SUM(AY$77:AY79),0),0)","v":0},{"$f":"IFERROR(IF(AZ$84>=9,SUM(AZ$77:AZ79),0),0)","v":0},{"$f":"IFERROR(IF(BA$84>=9,SUM(BA$77:BA79),0),0)","v":0},{"$f":"IFERROR(IF(BB$84>=9,SUM(BB$77:BB79),0),0)","v":0},{"$f":"IFERROR(IF(BC$84>=9,SUM(BC$77:BC79),0),0)","v":0},{"$f":"IFERROR(IF(BD$84>=9,SUM(BD$77:BD79),0),0)","v":0},{"$f":"IFERROR(IF(BE$84>=9,SUM(BE$77:BE79),0),0)","v":0},{"$f":"IFERROR(IF(BF$84>=9,SUM(BF$77:BF79),0),0)","v":0},{"$f":"IFERROR(IF(BG$84>=9,SUM(BG$77:BG79),0),0)","v":0},{"$f":"IFERROR(IF(BH$84>=9,SUM(BH$77:BH79),0),0)","v":0},{"$f":"IFERROR(IF(BI$84>=9,SUM(BI$77:BI79),0),0)","v":0},{"$f":"IFERROR(IF(BJ$84>=9,SUM(BJ$77:BJ79),0),0)","v":0},{"$f":"IFERROR(IF(BK$84>=9,SUM(BK$77:BK79),0),0)","v":0},{"$f":"IFERROR(IF(BL$84>=9,SUM(BL$77:BL79),0),0)","v":0},{"$f":"IFERROR(IF(BM$84>=9,SUM(BM$77:BM79),0),0)","v":0},{"$f":"IFERROR(IF(BN$84>=9,SUM(BN$77:BN79),0),0)","v":0},{"$f":"IFERROR(IF(BO$84>=9,SUM(BO$77:BO79),0),0)","v":0},{"$f":"IFERROR(IF(BP$84>=9,SUM(BP$77:BP79),0),0)","v":0},{"$f":"IFERROR(IF(BQ$84>=9,SUM(BQ$77:BQ79),0),0)","v":0},{"$f":"IFERROR(IF(BR$84>=9,SUM(BR$77:BR79),0),0)","v":0},{"$f":"IFERROR(IF(BS$84>=9,SUM(BS$77:BS79),0),0)","v":0},{"$f":"IFERROR(IF(BT$84>=9,SUM(BT$77:BT79),0),0)","v":0},{"$f":"IFERROR(IF(BU$84>=9,SUM(BU$77:BU79),0),0)","v":0},{"$f":"IFERROR(IF(BV$84>=9,SUM(BV$77:BV79),0),0)","v":0},{"$f":"IFERROR(IF(BW$84>=9,SUM(BW$77:BW79),0),0)","v":0},{"$f":"IFERROR(IF(BX$84>=9,SUM(BX$77:BX79),0),0)","v":0},{"$f":"IFERROR(IF(BY$84>=9,SUM(BY$77:BY79),0),0)","v":0},{"$f":"IFERROR(IF(BZ$84>=9,SUM(BZ$77:BZ79),0),0)","v":0},{"$f":"IFERROR(IF(CA$84>=9,SUM(CA$77:CA79),0),0)","v":0},{"$f":"IFERROR(IF(CB$84>=9,SUM(CB$77:CB79),0),0)","v":0},{"$f":"IFERROR(IF(CC$84>=9,SUM(CC$77:CC79),0),0)","v":0},{"$f":"IFERROR(IF(CD$84>=9,SUM(CD$77:CD79),0),0)","v":0},{"$f":"IFERROR(IF(CE$84>=9,SUM(CE$77:CE79),0),0)","v":0},{"$f":"IFERROR(IF(CF$84>=9,SUM(CF$77:CF79),0),0)","v":0},{"$f":"IFERROR(IF(CG$84>=9,SUM(CG$77:CG79),0),0)","v":0},{"$f":"IFERROR(IF(CH$84>=9,SUM(CH$77:CH79),0),0)","v":0},{"$f":"IFERROR(IF(CI$84>=9,SUM(CI$77:CI79),0),0)","v":0},{"$f":"IFERROR(IF(CJ$84>=9,SUM(CJ$77:CJ79),0),0)","v":0},{"$f":"IFERROR(IF(CK$84>=9,SUM(CK$77:CK79),0),0)","v":0},{"$f":"IFERROR(IF(CL$84>=9,SUM(CL$77:CL79),0),0)","v":0},{"$f":"IFERROR(IF(CM$84>=9,SUM(CM$77:CM79),0),0)","v":0},{"$f":"IFERROR(IF(CN$84>=9,SUM(CN$77:CN79),0),0)","v":0},{"$f":"IFERROR(IF(CO$84>=9,SUM(CO$77:CO79),0),0)","v":0},{"$f":"IFERROR(IF(CP$84>=9,SUM(CP$77:CP79),0),0)","v":0},{"$f":"IFERROR(IF(CQ$84>=9,SUM(CQ$77:CQ79),0),0)","v":337},{"$f":"IFERROR(IF(CR$84>=9,SUM(CR$77:CR79),0),0)","v":0},{"$f":"IFERROR(IF(CS$84>=9,SUM(CS$77:CS79),0),0)","v":0}]
[4,"Macclesfield H"," ","Barry, Keira",152,null,"Blunn, Hayden",null,147,null,"Carroll, Serena",null,126,null,null,425,null,{"$f":"COUNTIF($B$85:B88,B88)","v":1},6,5,28,null,null,null,null,null,null,null,null,null,null,"D Team",null,"Eligible Teams",{"$f":"IFERROR(IF(AI$84>=12,SUM(AI$80:AI82),0),0)","v":0},{"$f":"IFERROR(IF(AJ$84>=12,SUM(AJ$80:AJ82),0),0)","v":0},{"$f":"IFERROR(IF(AK$84>=12,SUM(AK$80:AK82),0),0)","v":0},{"$f":"IFERROR(IF(AL$84>=12,SUM(AL$80:AL82),0),0)","v":0},{"$f":"IFERROR(IF(AM$84>=12,SUM(AM$80:AM82),0),0)","v":0},{"$f":"IFERROR(IF(AN$84>=12,SUM(AN$80:AN82),0),0)","v":0},{"$f":"IFERROR(IF(AO$84>=12,SUM(AO$80:AO82),0),0)","v":0},{"$f":"IFERROR(IF(AP$84>=12,SUM(AP$80:AP82),0),0)","v":0},{"$f":"IFERROR(IF(AQ$84>=12,SUM(AQ$80:AQ82),0),0)","v":0},{"$f":"IFERROR(IF(AR$84>=12,SUM(AR$80:AR82),0),0)","v":0},{"$f":"IFERROR(IF(AS$84>=12,SUM(AS$80:AS82),0),0)","v":0},{"$f":"IFERROR(IF(AT$84>=12,SUM(AT$80:AT82),0),0)","v":0},{"$f":"IFERROR(IF(AU$84>=12,SUM(AU$80:AU82),0),0)","v":0},{"$f":"IFERROR(IF(AV$84>=12,SUM(AV$80:AV82),0),0)","v":0},{"$f":"IFERROR(IF(AW$84>=12,SUM(AW$80:AW82),0),0)","v":0},{"$f":"IFERROR(IF(AX$84>=12,SUM(AX$80:AX82),0),0)","v":0},{"$f":"IFERROR(IF(AY$84>=12,SUM(AY$80:AY82),0),0)","v":0},{"$f":"IFERROR(IF(AZ$84>=12,SUM(AZ$80:AZ82),0),0)","v":0},{"$f":"IFERROR(IF(BA$84>=12,SUM(BA$80:BA82),0),0)","v":0},{"$f":"IFERROR(IF(BB$84>=12,SUM(BB$80:BB82),0),0)","v":0},{"$f":"IFERROR(IF(BC$84>=12,SUM(BC$80:BC82),0),0)","v":0},{"$f":"IFERROR(IF(BD$84>=12,SUM(BD$80:BD82),0),0)","v":0},{"$f":"IFERROR(IF(BE$84>=12,SUM(BE$80:BE82),0),0)","v":0},{"$f":"IFERROR(IF(BF$84>=12,SUM(BF$80:BF82),0),0)","v":0},{"$f":"IFERROR(IF(BG$84>=12,SUM(BG$80:BG82),0),0)","v":0},{"$f":"IFERROR(IF(BH$84>=12,SUM(BH$80:BH82),0),0)","v":0},{"$f":"IFERROR(IF(BI$84>=12,SUM(BI$80:BI82),0),0)","v":0},{"$f":"IFERROR(IF(BJ$84>=12,SUM(BJ$80:BJ82),0),0)","v":0},{"$f":"IFERROR(IF(BK$84>=12,SUM(BK$80:BK82),0),0)","v":0},{"$f":"IFERROR(IF(BL$84>=12,SUM(BL$80:BL82),0),0)","v":0},{"$f":"IFERROR(IF(BM$84>=12,SUM(BM$80:BM82),0),0)","v":0},{"$f":"IFERROR(IF(BN$84>=12,SUM(BN$80:BN82),0),0)","v":0},{"$f":"IFERROR(IF(BO$84>=12,SUM(BO$80:BO82),0),0)","v":0},{"$f":"IFERROR(IF(BP$84>=12,SUM(BP$80:BP82),0),0)","v":0},{"$f":"IFERROR(IF(BQ$84>=12,SUM(BQ$80:BQ82),0),0)","v":0},{"$f":"IFERROR(IF(BR$84>=12,SUM(BR$80:BR82),0),0)","v":0},{"$f":"IFERROR(IF(BS$84>=12,SUM(BS$80:BS82),0),0)","v":0},{"$f":"IFERROR(IF(BT$84>=12,SUM(BT$80:BT82),0),0)","v":0},{"$f":"IFERROR(IF(BU$84>=12,SUM(BU$80:BU82),0),0)","v":0},{"$f":"IFERROR(IF(BV$84>=12,SUM(BV$80:BV82),0),0)","v":0},{"$f":"IFERROR(IF(BW$84>=12,SUM(BW$80:BW82),0),0)","v":0},{"$f":"IFERROR(IF(BX$84>=12,SUM(BX$80:BX82),0),0)","v":0},{"$f":"IFERROR(IF(BY$84>=12,SUM(BY$80:BY82),0),0)","v":0},{"$f":"IFERROR(IF(BZ$84>=12,SUM(BZ$80:BZ82),0),0)","v":0},{"$f":"IFERROR(IF(CA$84>=12,SUM(CA$80:CA82),0),0)","v":0},{"$f":"IFERROR(IF(CB$84>=12,SUM(CB$80:CB82),0),0)","v":0},{"$f":"IFERROR(IF(CC$84>=12,SUM(CC$80:CC82),0),0)","v":0},{"$f":"IFERROR(IF(CD$84>=12,SUM(CD$80:CD82),0),0)","v":0},{"$f":"IFERROR(IF(CE$84>=12,SUM(CE$80:CE82),0),0)","v":0},{"$f":"IFERROR(IF(CF$84>=12,SUM(CF$80:CF82),0),0)","v":0},{"$f":"IFERROR(IF(CG$84>=12,SUM(CG$80:CG82),0),0)","v":0},{"$f":"IFERROR(IF(CH$84>=12,SUM(CH$80:CH82),0),0)","v":0},{"$f":"IFERROR(IF(CI$84>=12,SUM(CI$80:CI82),0),0)","v":0},{"$f":"IFERROR(IF(CJ$84>=12,SUM(CJ$80:CJ82),0),0)","v":0},{"$f":"IFERROR(IF(CK$84>=12,SUM(CK$80:CK82),0),0)","v":0},{"$f":"IFERROR(IF(CL$84>=12,SUM(CL$80:CL82),0),0)","v":0},{"$f":"IFERROR(IF(CM$84>=12,SUM(CM$80:CM82),0),0)","v":0},{"$f":"IFERROR(IF(CN$84>=12,SUM(CN$80:CN82),0),0)","v":0},{"$f":"IFERROR(IF(CO$84>=12,SUM(CO$80:CO82),0),0)","v":0},{"$f":"IFERROR(IF(CP$84>=12,SUM(CP$80:CP82),0),0)","v":0},{"$f":"IFERROR(IF(CQ$84>=12,SUM(CQ$80:CQ82),0),0)","v":0},{"$f":"IFERROR(IF(CR$84>=12,SUM(CR$80:CR82),0),0)","v":0},{"$f":"IFERROR(IF(CS$84>=12,SUM(CS$80:CS82),0),0)","v":0}]
[5,"West Cheshire","B","Bojang, Fatoumatta",139,null,"Pughe, Imogen",null,133,null,"Jones, Stephanie",null,128,null,null,400,null,{"$f":"COUNTIF($B$85:B89,B89)","v":2},18,17,20,null,null,null,null,null,null,null,null,null,null,null,null,"Rank",{"$f":"IF(AI85>2,RANK(AI85,$AI$85:$BC$87),\"\")","v":""},{"$f":"IF(AJ85>2,RANK(AJ85,$AI$85:$BC$87),\"\")","v":""},"","","","","","",2,"","","","","","","",3,"",1,"","",{"$f":"IF(BD85>2,RANK(BD85,$BD$85:$BX$87),\"\")","v":""},{"$f":"IF(BE85>2,RANK(BE85,$BD$85:$BX$87),\"\")","v":""},2,"","","","","","","","","","","",4,"",1,"",3,"","",{"$f":"IF(BY85>2,RANK(BY85,$BY$85:$CS$88),\"\")","v":""},{"$f":"IF(BZ85>2,RANK(BZ85,$BY$85:$CS$88),\"\")","v":""},1,"","","",9,"",4,"","","","","",6,"",2,"",3,"",""]
[6,"Stockport H"," ","Doodson, Jack",169,null,"Ayre, Sam",null,102,null,"Culmer, Tom",null,99,null,null,370,null,{"$f":"COUNTIF($B$85:B90,B90)","v":1},33,34,31,null,null,null,null,null,null,null,null,null,null,null,null,"Rank",{"$f":"IF(AI86>2,RANK(AI86,$AI$85:$BC$87),\"\")","v":""},"","","","","","","","","","","","","","","","","","","","",{"$f":"IF(BD86>2,RANK(BD86,$BD$85:$BX$87),\"\")","v":""},{"$f":"IF(BE86>2,RANK(BE86,$BD$85:$BX$87),\"\")","v":""},"","","","","","","","","","","","","","","","","","","",{"$f":"IF(BY86>2,RANK(BY86,$BY$85:$CS$88),\"\")","v":""},{"$f":"IF(BZ86>2,RANK(BZ86,$BY$85:$CS$88),\"\")","v":""},"","","","","","","","","","","","","","",7,"",5,"",""]
[7,"Vale Royal","B","Sproston, Hannah",129,null,"Haffenden, Peter",null,125,null,"Stapleton, Scarlett",null,110,null,null,364,null,{"$f":"COUNTIF($B$85:B91,B91)","v":2},14,13,38,null,null,null,null,null,null,null,null,null,null,null,null,"Rank",{"$f":"IF(AI87>2,RANK(AI87,$AI$85:$BC$87),\"\")","v":""},"","","","","","","","","","","","","","","","","","","","",{"$f":"IF(BD87>2,RANK(BD87,$BD$85:$BX$87),\"\")","v":""},"","","","","","","","","","","","","","","","","","","","",{"$f":"IF(BY87>2,RANK(BY87,$BY$85:$CS$88),\"\")","v":""},"","","","","","","","","","","","","","","","","",8,"",""]
[8,"West Cheshire","C","Shillington, Isla",122,null,"Bugg, Harry",null,114,null,"Bemand, Jodi",null,101,null,null,337,null,{"$f":"COUNTIF($B$85:B92,B92)","v":3},16,22,41,null,null,null,null,null,null,null,null,null,null,null,null,"Rank",{"$f":"IF(AI88>2,RANK(AI88,$AI$85:$BC$87),\"\")","v":""},"","","","","","","","","","","","","","","","","","","","",{"$f":"IF(BD88>2,RANK(BD88,$BD$85:$BX$87),\"\")","v":""},"","","","","","","","","","","","","","","","","","","","",{"$f":"IF(BY88>2,RANK(BY88,$BY$85:$CS$88),\"\")","v":""},"","","","","","","","","","","","","","","","","","","",""]
[9,"Handforth WAAC"," ","Duce, Anna",120,null,"Cann, Marcus",null,103,null,"Branthwaite, Owen",null,103,null,null,326,null,{"$f":"COUNTIF($B$85:B93,B93)","v":1},26,4,27,null,null,null,null,null,null,"Rank","Total"]
[10,{"$error":"#N/A"}," ",{"$error":"#N/A"},{"$error":"#N/A"},null,{"$error":"#N/A"},null,{"$error":"#N/A"},null,{"$error":"#N/A"},null,{"$error":"#N/A"},null,null,{"$error":"#N/A"},null,{"$f":"COUNTIF($B$85:B94,B94)","v":1},{"$error":"#N/A"},{"$error":"#N/A"},{"$error":"#N/A"},null,null,null,null,null,null,1,1," "]
[11,null,0,null,null,null,null,null,null,null,null,null,null,null,null,null,null,null,null,null,null,null,null,null,null,null,null,2,1,"B"]
[12,null,0,null,null,null,null,null,null,null,null,null,null,null,null,null,null,null,null,null,null,null,null,null,null,null,null,3,1,"C"]
[null,null,null,null,null,null,null,null,null,null,null,null,null,null,null,null,null,null,null,null,null,null,null,null,null,null,null,4,2,"D"]
[null,null,null,null,null,null,null,null,null,null,null,null,null,null,null,null,null,null,null,null,null,null,null,null,null,null,null,5,2,"E"]
["Girls Teams",null,null,null,null,{"$f":"IF(E99=\"DNF\",0,IF(E99=0,0,IF(E99<=14,VLOOKUP(E99,T_100m,15,TRUE),IF(E99<=15.2,VLOOKUP(E99,T_100m,15,TRUE),IF(E99<=21,VLOOKUP(E99-0.01,T_100m,15,TRUE)-1,0)))))","v":0},null,{"$f":"IF(G99=\"DNF\",0,IF(G99=0,0,VLOOKUP(G99,T_800m,11,TRUE)-1))","v":0},null,{"$f":"IF(I99=\"NJ\",0,IF(I99<'Scoring Tables'!$S$4,0,VLOOKUP(I99,T_Long,11,TRUE)))","v":0},null,{"$f":"IF(K99=\"NT\",0,IF(K99<'Scoring Tables'!$X$14,0,VLOOKUP(K99,T_Javlin,6,TRUE)))","v":0},{"$f":"(LARGE((F99,H99),1)+J99+L99)","v":0},{"$f":"IF(M99=0,\"\",IF(C99=\"M\",(RANK(M99,AG$7:AG$97)&\"B\"),RANK(M99,AH$7:AH$95)&\"G\"))","v":""},{"$f":"IF(M99<15,\"\",HLOOKUP(M99,T_U11G_3_Events,3))","v":""},"Total",null,"Team",null,null,null,null,null,null,null,null,null,6,2,"F"]
[1,{"$f":"OFFSET($D$6,S100,0,1,1)","v":"Macclesfield H"},{"$f":"IFERROR(VLOOKUP(R100,$AB$94:$AD$105,3,1),0)","v":" "},{"$f":"OFFSET($B$6,S100,0,1,1)","v":"Dilworth, Rebecca"},{"$f":"OFFSET($M$6,S100,0,1,1)","v":98},null,{"$f":"OFFSET($B$6,T100,0,1,1)","v":{"$error":"#N/A"}},null,{"$f":"OFFSET($M$6,T100,0,1,1)","v":{"$error":"#N/A"}},null,{"$f":"OFFSET($B$6,U100,0,1,1)","v":{"$error":"#N/A"}},null,{"$f":"OFFSET($M$6,U100,0,1,1)","v":{"$error":"#N/A"}},null,null,{"$f":"OFFSET($R$6,S100,0,1,1)","v":0},null,{"$f":"COUNTIF($B$100:B100,B100)","v":1},{"$f":"MATCH((ROW()-100)*3 +1,$W$7:$W$68,0)","v":7},{"$f":"MATCH((ROW()-100)*3 +2,$W$7:$W$68,0)","v":{"$error":"#N/A"}},{"$f":"MATCH((ROW()-100)*3 +3,$W$7:$W$68,0)","v":{"$error":"#N/A"}},null,null,null,null,null,null,7,3,"G"]
[2,{"$f":"OFFSET($D$6,S101,0,1,1)","v":{"$error":"#N/A"}},{"$f":"IFERROR(VLOOKUP(R101,$AB$94:$AD$105,3,1),0)","v":" "},{"$f":"OFFSET($B$6,S101,0,1,1)","v":{"$error":"#N/A"}},{"$f":"OFFSET($M$6,S101,0,1,1)","v":{"$error":"#N/A"}},null,{"$f":"OFFSET($B$6,T101,0,1,1)","v":{"$error":"#N/A"}},null,{"$f":"OFFSET($M$6,T101,0,1,1)","v":{"$error":"#N/A"}},null,{"$f":"OFFSET($B$6,U101,0,1,1)","v":{"$error":"#N/A"}},null,{"$f":"OFFSET($M$6,U101,0,1,1)","v":{"$error":"#N/A"}},null,null,{"$f":"OFFSET($R$6,S101,0,1,1)","v":{"$error":"#N/A"}},null,{"$f":"COUNTIF($B$100:B101,B101)","v":1},{"$f":"MATCH((ROW()-100)*3 +1,$W$7:$W$68,0)","v":{"$error":"#N/A"}},{"$f":"MATCH((ROW()-100)*3 +2,$W$7:$W$68,0)","v":{"$error":"#N/A"}},{"$f":"MATCH((ROW()-100)*3 +3,$W$7:$W$68,0)","v":{"$error":"#N/A"}},null,null,null,null,null,null,8,3]
[3,{"$f":"OFFSET($D$6,S102,0,1,1)","v":{"$error":"#N/A"}},"B",{"$f":"OFFSET($B$6,S102,0,1,1)","v":{"$error":"#N/A"}},{"$f":"OFFSET($M$6,S102,0,1,1)","v":{"$error":"#N/A"}},null,{"$f":"OFFSET($B$6,T102,0,1,1)","v":{"$error":"#N/A"}},null,{"$f":"OFFSET($M$6,T102,0,1,1)","v":{"$error":"#N/A"}},null,{"$f":"OFFSET($B$6,U102,0,1,1)","v":{"$error":"#N/A"}},null,{"$f":"OFFSET($M$6,U102,0,1,1)","v":{"$error":"#N/A"}},null,null,{"$f":"OFFSET($R$6,S102,0,1,1)","v":{"$error":"#N/A"}},null,{"$f":"COUNTIF($B$100:B102,B102)","v":2},{"$f":"MATCH((ROW()-100)*3 +1,$W$7:$W$68,0)","v":{"$error":"#N/A"}},{"$f":"MATCH((ROW()-100)*3 +2,$W$7:$W$68,0)","v":{"$error":"#N/A"}},{"$f":"MATCH((ROW()-100)*3 +3,$W$7:$W$68,0)","v":{"$error":"#N/A"}},null,null,null,null,null,null,9,3]
[4,{"$f":"OFFSET($D$6,S103,0,1,1)","v":{"$error":"#N/A"}},"C",{"$f":"OFFSET($B$6,S103,0,1,1)","v":{"$error":"#N/A"}},{"$f":"OFFSET($M$6,S103,0,1,1)","v":{"$error":"#N/A"}},null,{"$f":"OFFSET($B$6,T103,0,1,1)","v":{"$error":"#N/A"}},null,{"$f":"OFFSET($M$6,T103,0,1,1)","v":{"$error":"#N/A"}},null,{"$f":"OFFSET($B$6,U103,0,1,1)","v":{"$error":"#N/A"}},null,{"$f":"OFFSET($M$6,U103,0,1,1)","v":{"$error":"#N/A"}},null,null,{"$f":"OFFSET($R$6,S103,0,1,1)","v":{"$error":"#N/A"}},null,{"$f":"COUNTIF($B$100:B103,B103)","v":3},{"$f":"MATCH((ROW()-100)*3 +1,$W$7:$W$68,0)","v":{"$error":"#N/A"}},{"$f":"MATCH((ROW()-100)*3 +2,$W$7:$W$68,0)","v":{"$error":"#N/A"}},{"$f":"MATCH((ROW()-100)*3 +3,$W$7:$W$68,0)","v":{"$error":"#N/A"}},null,null,null,null,null,null,10,4]
[5,{"$f":"OFFSET($D$6,S104,0,1,1)","v":{"$error":"#N/A"}},"D",{"$f":"OFFSET($B$6,S104,0,1,1)","v":{"$error":"#N/A"}},{"$f":"OFFSET($M$6,S104,0,1,1)","v":{"$error":"#N/A"}},null,{"$f":"OFFSET($B$6,T104,0,1,1)","v":{"$error":"#N/A"}},null,{"$f":"OFFSET($M$6,T104,0,1,1)","v":{"$error":"#N/A"}},null,{"$f":"OFFSET($B$6,U104,0,1,1)","v":{"$error":"#N/A"}},null,{"$f":"OFFSET($M$6,U104,0,1,1)","v":{"$error":"#N/A"}},null,null,{"$f":"OFFSET($R$6,S104,0,1,1)","v":{"$error":"#N/A"}},null,{"$f":"COUNTIF($B$100:B104,B104)","v":4},{"$f":"MATCH((ROW()-100)*3 +1,$W$7:$W$68,0)","v":{"$error":"#N/A"}},{"$f":"MATCH((ROW()-100)*3 +2,$W$7:$W$68,0)","v":{"$error":"#N/A"}},{"$f":"MATCH((ROW()-100)*3 +3,$W$7:$W$68,0)","v":{"$error":"#N/A"}},null,null,null,null,null,null,11,4]
[6,null,0,null,null,null,null,null,null,null,null,null,null,null,null,null,null,null,null,null,null,null,null,null,null,null,null,12,4]
[7,null,0]
[8,null,0]
[]
["Boys Teams",null,null,null,null,null,null,null,null,null,null,null,null,null,null,"Total",null,"Team"]
[1,{"$f":"OFFSET($D$6,S110,0,1,1)","v":"Vale Royal"},{"$f":"IFERROR(VLOOKUP(R110,$AB$94:$AD$105,3,1),0)","v":" "},{"$f":"OFFSET($B$6,S110,0,1,1)","v":"Griffith, Patrick"},{"$f":"OFFSET($M$6,S110,0,1,1)","v":161},null,{"$f":"OFFSET($B$6,T110,0,1,1)","v":"Carney, Dylan"},null,{"$f":"OFFSET($M$6,T110,0,1,1)","v":144},null,{"$f":"OFFSET($B$6,U110,0,1,1)","v":"Jenkins, Hadyn"},null,{"$f":"OFFSET($M$6,U110,0,1,1)","v":113},null,null,{"$f":"OFFSET($R$6,S110,0,1,1)","v":440},null,{"$f":"COUNTIF($B$110:B110,B110)","v":1},{"$f":"MATCH((ROW()-110)*3 +1,$Y$7:$Y$68,0)","v":37},{"$f":"MATCH((ROW()-110)*3 +2,$Y$7:$Y$68,0)","v":36},{"$f":"MATCH((ROW()-110)*3 +3,$Y$7:$Y$68,0)","v":24}]
[2,{"$f":"OFFSET($D$6,S111,0,1,1)","v":"West Cheshire"},{"$f":"IFERROR(VLOOKUP(R111,$AB$94:$AD$105,3,1),0)","v":" "},{"$f":"OFFSET($B$6,S111,0,1,1)","v":"Grinter, Zac"},{"$f":"OFFSET($M$6,S111,0,1,1)","v":145},null,{"$f":"OFFSET($B$6,T111,0,1,1)","v":"Shakespeare-Wetton, Harley"},null,{"$f":"OFFSET($M$6,T111,0,1,1)","v":141},null,{"$f":"OFFSET($B$6,U111,0,1,1)","v":"Ayre, Sam"},null,{"$f":"OFFSET($M$6,U111,0,1,1)","v":102},null,null,{"$f":"OFFSET($R$6,S111,0,1,1)","v":432},null,{"$f":"COUNTIF($B$110:B111,B111)","v":1},{"$f":"MATCH((ROW()-110)*3 +1,$Y$7:$Y$68,0)","v":42},{"$f":"MATCH((ROW()-110)*3 +2,$Y$7:$Y$68,0)","v":44},{"$f":"MATCH((ROW()-110)*3 +3,$Y$7:$Y$68,0)","v":31}]
[3,{"$f":"OFFSET($D$6,S112,0,1,1)","v":"Stockport H"}," ",{"$f":"OFFSET($B$6,S112,0,1,1)","v":"Culmer, Frank"},{"$f":"OFFSET($M$6,S112,0,1,1)","v":0},null,{"$f":"OFFSET($B$6,T112,0,1,1)","v":{"$error":"#N/A"}},null,{"$f":"OFFSET($M$6,T112,0,1,1)","v":{"$error":"#N/A"}},null,{"$f":"OFFSET($B$6,U112,0,1,1)","v":{"$error":"#N/A"}},null,{"$f":"OFFSET($M$6,U112,0,1,1)","v":{"$error":"#N/A"}},null,null,{"$f":"OFFSET($R$6,S112,0,1,1)","v":0},null,{"$f":"COUNTIF($B$110:B112,B112)","v":1},{"$f":"MATCH((ROW()-110)*3 +1,$Y$7:$Y$68,0)","v":32},{"$f":"MATCH((ROW()-110)*3 +2,$Y$7:$Y$68,0)","v":{"$error":"#N/A"}},{"$f":"MATCH((ROW()-110)*3 +3,$Y$7:$Y$68,0)","v":{"$error":"#N/A"}}]
[4,{"$f":"OFFSET($D$6,S113,0,1,1)","v":{"$error":"#N/A"}}," ",{"$f":"OFFSET($B$6,S113,0,1,1)","v":{"$error":"#N/A"}},{"$f":"OFFSET($M$6,S113,0,1,1)","v":{"$error":"#N/A"}},null,{"$f":"OFFSET($B$6,T113,0,1,1)","v":{"$error":"#N/A"}},null,{"$f":"OFFSET($M$6,T113,0,1,1)","v":{"$error":"#N/A"}},null,{"$f":"OFFSET($B$6,U113,0,1,1)","v":{"$error":"#N/A"}},null,{"$f":"OFFSET($M$6,U113,0,1,1)","v":{"$error":"#N/A"}},null,null,{"$f":"OFFSET($R$6,S113,0,1,1)","v":{"$error":"#N/A"}},null,{"$f":"COUNTIF($B$110:B113,B113)","v":1},{"$f":"MATCH((ROW()-110)*3 +1,$Y$7:$Y$68,0)","v":{"$error":"#N/A"}},{"$f":"MATCH((ROW()-110)*3 +2,$Y$7:$Y$68,0)","v":{"$error":"#N/A"}},{"$f":"MATCH((ROW()-110)*3 +3,$Y$7:$Y$68,0)","v":{"$error":"#N/A"}}]
[5,{"$f":"OFFSET($D$6,S114,0,1,1)","v":{"$error":"#N/A"}},"B",{"$f":"OFFSET($B$6,S114,0,1,1)","v":{"$error":"#N/A"}},{"$f":"OFFSET($M$6,S114,0,1,1)","v":{"$error":"#N/A"}},null,{"$f":"OFFSET($B$6,T114,0,1,1)","v":{"$error":"#N/A"}},null,{"$f":"OFFSET($M$6,T114,0,1,1)","v":{"$error":"#N/A"}},null,{"$f":"OFFSET($B$6,U114,0,1,1)","v":{"$error":"#N/A"}},null,{"$f":"OFFSET($M$6,U114,0,1,1)","v":{"$error":"#N/A"}},null,null,{"$f":"OFFSET($R$6,S114,0,1,1)","v":{"$error":"#N/A"}},null,{"$f":"COUNTIF($B$110:B114,B114)","v":2},{"$f":"MATCH((ROW()-110)*3 +1,$Y$7:$Y$68,0)","v":{"$error":"#N/A"}},{"$f":"MATCH((ROW()-110)*3 +2,$Y$7:$Y$68,0)","v":{"$error":"#N/A"}},{"$f":"MATCH((ROW()-110)*3 +3,$Y$7:$Y$68,0)","v":{"$error":"#N/A"}}]
[6,null,0]
[7,null,0]
[8,null,0]

{"sheet":"U13B Tri","index":3,"n_rows":42,"n_cols":34,"rows_kept":42,"cut":false,"hidden":false,"merged":[[0,0,0,28],[1,8,1,15],[4,10,4,13]]}
["CHESHIRE COUNTY ATHLETICS ASSOCIATION - Junior Multievent Championship, Macclesfield"]
[null,null,null,null,null,null,null,null,"U13 Boys "]
[]
["Arranged by:",null,{"$f":"ArrangedBy","v":"Handforth W A A C"},null,null,null,null,"Scorer:",null,null,{"$f":"Scorer","v":"H Branthwaite"},null,null,null,null,null,null,null,null,null,null,null,null,"Date:",null,{"$f":"Date","v":"2015-09-13"}]
["Sponsored by:",null,{"$f":"Sponsor","v":"Jones Homes"},null,null,null,null,"Checked by:",null,null,"S Cathery & M Norman"]
["No.","Name","Club","Cheshire","100m","Score","Grade","75m\nHurdles","Score","Grade","800m","Score","Grade","Long\nJump","Score","Grade","High\nJump","Score","Grade","Shot","Score","Grade","Jav.","Score","Grade","Total\nScore\n3 events","Chesh\nPosit'n\n","Open\nPosit'n\n","Five\nStar\nAward",null,null,null,"Chesh\nOnly","Last Col"]
[68,"Verbickas, Ben","Crewe & Nantwich","C",null,{"$f":"IF(E7=\"DNF\",0,IF(E7=0,0,IF(E7<=14,VLOOKUP(E7,T_100m,15,TRUE),IF(E7<=15.2,VLOOKUP(E7,T_100m,15,TRUE),IF(E7<=21,VLOOKUP(E7-0.01,T_100m,15,TRUE)-1,0)))))","v":0},{"$f":"IF(F7=0,0,IF(E7<=INDEX(AAA_U13B_100m,1,1),\"G1\",IF(E7<=INDEX(AAA_U13B_100m,1,2),\"G2\",IF(E7<=INDEX(AAA_U13B_100m,1,3),\"G3\",IF(E7<=INDEX(AAA_U13B_100m,1,4),\"G4\",0)))))","v":0},15.2,{"$f":"IF(H7=\"DNF\",0,IF(H7=0,0,VLOOKUP(H7,T_70_Hurdles,7,TRUE)))","v":56},{"$f":"IF(I7=0,0,IF(H7<=INDEX(AAA_U13B_75mH,1,1),\"G1\",IF(H7<=INDEX(AAA_U13B_75mH,1,2),\"G2\",IF(H7<=INDEX(AAA_U13B_75mH,1,3),\"G3\",IF(H7<=INDEX(AAA_U13B_75mH,1,4),\"G4\",0)))))","v":"G4"},"00:02:46.800",{"$f":"IF(K7=\"DNF\",0,IF(K7=0,0,VLOOKUP(K7,T_800m,11,TRUE)-1))","v":66},{"$f":"IF(L7=0,0,IF(K7<=INDEX(AAA_U13B_800m,1,1),\"G1\",IF(K7<=INDEX(AAA_U13B_800m,1,2),\"G2\",IF(K7<=INDEX(AAA_U13B_800m,1,3),\"G3\",IF(K7<=INDEX(AAA_U13B_800m,1,4),\"G4\",0)))))","v":0},2.93,{"$f":"IF(N7=\"NJ\",0,IF(N7=0,0,VLOOKUP(N7,T_Long,11,TRUE)))","v":35},{"$f":"IF(O7=0,0,IF(N7>=INDEX(AAA_U13B_LJ,1,1),\"G1\",IF(N7>=INDEX(AAA_U13B_LJ,1,2),\"G2\",IF(N7>=INDEX(AAA_U13B_LJ,1,3),\"G3\",IF(N7>=INDEX(AAA_U13B_LJ,1,4),\"G4\",0)))))","v":0},null,{"$f":"IF(Q7=\"NJ\",0,IF(Q7=0,0,VLOOKUP(Q7,T_High,12,TRUE)))","v":0},{"$f":"IF(R7=0,0,IF(Q7>=INDEX(AAA_U13B_HJ,1,1),\"G1\",IF(Q7>=INDEX(AAA_U13B_HJ,1,2),\"G2\",IF(Q7>=INDEX(AAA_U13B_HJ,1,3),\"G3\",IF(Q7>=INDEX(AAA_U13B_HJ,1,4),\"G4\",0)))))","v":0},4.4400000000000004,{"$f":"IF(T7=\"NT\",0,IF(T7<2,0,VLOOKUP(T7,T_Shot,8,TRUE)))","v":35},{"$f":"IF(U7=0,0,IF(T7>=INDEX(AAA_U13B_Shot,1,1),\"G1\",IF(T7>=INDEX(AAA_U13B_Shot,1,2),\"G2\",IF(T7>=INDEX(AAA_U13B_Shot,1,3),\"G3\",IF(T7>=INDEX(AAA_U13B_Shot,1,4),\"G4\",0)))))","v":0},null,{"$f":"IF(W7=\"NT\",0,IF(W7<4,0,VLOOKUP(W7,T_Javlin,6,TRUE)))","v":0},{"$f":"IF(X7=0,0,IF(W7>=INDEX(AAA_U13B_Jav,1,1),\"G1\",IF(W7>=INDEX(AAA_U13B_Jav,1,2),\"G2\",IF(W7>=INDEX(AAA_U13B_Jav,1,3),\"G3\",IF(W7>=INDEX(AAA_U13B_Jav,1,4),\"G4\",0)))))","v":0},{"$f":"(LARGE((F7,I7,L7),1)+LARGE((O7,R7),1)+LARGE((U7,X7),1))","v":136},{"$f":"IF(AG7=0,\"\",RANK(Z7,AG$7:AG$41))","v":11},{"$f":"IF(Z7=0,\"\",RANK(Z7,Z$7:Z$41))","v":13},{"$f":"IF(Z7<15,\"\",HLOOKUP(Z7,T_U13B_3_Events,5))","v":"3*"},null,null,null,{"$f":"IF(D7=\"C\",Z7,0)","v":136}]
[69,"Cathery, Joseph","Handforth WAAC","C",null,0,0,16.5,43,0,"00:03:15.600",52,0,3.67,60,0,null,0,0,null,0,0,14.47,42,0,{"$f":"(LARGE((F8,I8,L8),1)+LARGE((O8,R8),1)+LARGE((U8,X8),1))","v":154},10,12,"3*",null,null,null,154]
[70,"Horne, Brandon","Handforth WAAC","C",null,0,0,null,0,0,null,0,0,null,0,0,1.18,54,0,6.62,57,0,null,0,0,{"$f":"(LARGE((F9,I9,L9),1)+LARGE((O9,R9),1)+LARGE((U9,X9),1))","v":111},13,15,"2*",null,null,null,111]
[71,"Danson, Sam","Macclesfield H","C",null,0,0,null,0,0,null,0,0,null,0,0,null,0,0,null,0,0,null,0,0,{"$f":"(LARGE((F10,I10,L10),1)+LARGE((O10,R10),1)+LARGE((U10,X10),1))","v":0},"","","",null,null,null,0]
[72,"Frith, Morgan","Macclesfield H","C",13.3,80,"G3",null,0,0,null,0,0,4.7300000000000004,78,"G1",null,0,0,6.37,54,0,null,0,0,{"$f":"(LARGE((F11,I11,L11),1)+LARGE((O11,R11),1)+LARGE((U11,X11),1))","v":212},1,1,"5*",null,null,null,212]
[73,"Roberts, Thomas","Macclesfield H","C",null,0,0,null,0,0,"00:02:42.700",68,0,null,0,0,1.18,54,0,null,0,0,15.87,48,0,{"$f":"(LARGE((F12,I12,L12),1)+LARGE((O12,R12),1)+LARGE((U12,X12),1))","v":170},9,10,"4*",null,null,null,170]
[74,"Thompson, Jacob","Macclesfield H","C",null,0,0,13.5,73,"G2",null,0,0,null,0,0,1.33,69,"G4",null,0,0,15.73,47,0,{"$f":"(LARGE((F13,I13,L13),1)+LARGE((O13,R13),1)+LARGE((U13,X13),1))","v":189},4,5,"4*",null,null,null,189]
[75,"Townend, Louis","Macclesfield H","C",14.5,63,0,null,0,0,null,0,0,3.82,65,0,null,0,0,5.63,47,0,null,0,0,{"$f":"(LARGE((F14,I14,L14),1)+LARGE((O14,R14),1)+LARGE((U14,X14),1))","v":175},8,9,"4*",null,null,null,175]
[76,"Cooper, Matthew","Manchester H",null,14.1,71,0,null,0,0,"00:02:30.500",74,"G4",3.4,51,0,null,0,0,5.29,43,0,null,0,0,{"$f":"(LARGE((F15,I15,L15),1)+LARGE((O15,R15),1)+LARGE((U15,X15),1))","v":168},"",11,"4*",null,null,null,0]
[77,"Hopkins, Jamie","Southport Waterloo",null,null,0,0,14.6,62,"G4","00:02:42.400",68,0,null,0,0,1.36,72,"G3",null,0,0,22.46,70,"G4",{"$f":"(LARGE((F16,I16,L16),1)+LARGE((O16,R16),1)+LARGE((U16,X16),1))","v":210},"",2,"5*",null,null,null,0]
[78,"Culmer, William","Stockport H","C",null,0,0,15.2,56,"G4","00:02:54.300",62,0,3.36,50,0,null,0,0,null,0,0,25.33,73,"G4",{"$f":"(LARGE((F17,I17,L17),1)+LARGE((O17,R17),1)+LARGE((U17,X17),1))","v":185},6,7,"4*",null,null,null,185]
[79,"Houlden, Matthew","Stockport H","C",13,83,"G2",null,0,0,null,0,0,3.95,69,0,null,0,0,6,51,0,null,0,0,{"$f":"(LARGE((F18,I18,L18),1)+LARGE((O18,R18),1)+LARGE((U18,X18),1))","v":203},2,3,"5*",null,null,null,203]
[80,"Shaw, Adam","Warrington","C",null,0,0,12.9,79,"G1",null,0,0,null,0,0,1.24,60,0,6.26,53,0,null,0,0,{"$f":"(LARGE((F19,I19,L19),1)+LARGE((O19,R19),1)+LARGE((U19,X19),1))","v":192},3,4,"4*",null,null,null,192]
[81,"Bugg, Dylan","West Cheshire","C",14.5,63,0,null,0,0,"00:02:38.500",70,0,3.66,60,0,null,0,0,null,0,0,17.05,53,0,{"$f":"(LARGE((F20,I20,L20),1)+LARGE((O20,R20),1)+LARGE((U20,X20),1))","v":183},7,8,"4*",null,null,null,183]
[82,"Howe, Adam","West Cheshire","C",13.9,74,"G4",null,0,0,"00:02:47.800",66,0,null,0,0,1.24,60,0,6.46,55,0,null,0,0,{"$f":"(LARGE((F21,I21,L21),1)+LARGE((O21,R21),1)+LARGE((U21,X21),1))","v":189},4,5,"4*",null,null,null,189]
[83,"Smith, Ivor","West Cheshire","C",15.7,44,0,null,0,0,null,0,0,3.15,43,0,null,0,0,4.57,36,0,null,0,0,{"$f":"(LARGE((F22,I22,L22),1)+LARGE((O22,R22),1)+LARGE((U22,X22),1))","v":123},12,14,"3*",null,null,null,123]
[null,null,null,null,null,{"$f":"IF(E23=\"DNF\",0,IF(E23=0,0,IF(E23<=14,VLOOKUP(E23,T_100m,15,TRUE),IF(E23<=15.2,VLOOKUP(E23,T_100m,15,TRUE),IF(E23<=21,VLOOKUP(E23-0.01,T_100m,15,TRUE)-1,0)))))","v":0},{"$f":"IF(F23=0,0,IF(E23<=INDEX(AAA_U13B_100m,1,1),\"G1\",IF(E23<=INDEX(AAA_U13B_100m,1,2),\"G2\",IF(E23<=INDEX(AAA_U13B_100m,1,3),\"G3\",IF(E23<=INDEX(AAA_U13B_100m,1,4),\"G4\",0)))))","v":0},null,{"$f":"IF(H23=\"DNF\",0,IF(H23=0,0,VLOOKUP(H23,T_70_Hurdles,7,TRUE)))","v":0},{"$f":"IF(I23=0,0,IF(H23<=INDEX(AAA_U13B_75mH,1,1),\"G1\",IF(H23<=INDEX(AAA_U13B_75mH,1,2),\"G2\",IF(H23<=INDEX(AAA_U13B_75mH,1,3),\"G3\",IF(H23<=INDEX(AAA_U13B_75mH,1,4),\"G4\",0)))))","v":0},null,{"$f":"IF(K23=\"DNF\",0,IF(K23=0,0,VLOOKUP(K23,T_800m,11,TRUE)-1))","v":0},{"$f":"IF(L23=0,0,IF(K23<=INDEX(AAA_U13B_800m,1,1),\"G1\",IF(K23<=INDEX(AAA_U13B_800m,1,2),\"G2\",IF(K23<=INDEX(AAA_U13B_800m,1,3),\"G3\",IF(K23<=INDEX(AAA_U13B_800m,1,4),\"G4\",0)))))","v":0},null,{"$f":"IF(N23=\"NJ\",0,IF(N23=0,0,VLOOKUP(N23,T_Long,11,TRUE)))","v":0},{"$f":"IF(O23=0,0,IF(N23>=INDEX(AAA_U13B_LJ,1,1),\"G1\",IF(N23>=INDEX(AAA_U13B_LJ,1,2),\"G2\",IF(N23>=INDEX(AAA_U13B_LJ,1,3),\"G3\",IF(N23>=INDEX(AAA_U13B_LJ,1,4),\"G4\",0)))))","v":0},null,{"$f":"IF(Q23=\"NJ\",0,IF(Q23=0,0,VLOOKUP(Q23,T_High,12,TRUE)))","v":0},{"$f":"IF(R23=0,0,IF(Q23>=INDEX(AAA_U13B_HJ,1,1),\"G1\",IF(Q23>=INDEX(AAA_U13B_HJ,1,2),\"G2\",IF(Q23>=INDEX(AAA_U13B_HJ,1,3),\"G3\",IF(Q23>=INDEX(AAA_U13B_HJ,1,4),\"G4\",0)))))","v":0},null,{"$f":"IF(T23=\"NT\",0,IF(T23<2,0,VLOOKUP(T23,T_Shot,8,TRUE)))","v":0},{"$f":"IF(U23=0,0,IF(T23>=INDEX(AAA_U13B_Shot,1,1),\"G1\",IF(T23>=INDEX(AAA_U13B_Shot,1,2),\"G2\",IF(T23>=INDEX(AAA_U13B_Shot,1,3),\"G3\",IF(T23>=INDEX(AAA_U13B_Shot,1,4),\"G4\",0)))))","v":0},null,{"$f":"IF(W23=\"NT\",0,IF(W23<4,0,VLOOKUP(W23,T_Javlin,6,TRUE)))","v":0},{"$f":"IF(X23=0,0,IF(W23>=INDEX(AAA_U13B_Jav,1,1),\"G1\",IF(W23>=INDEX(AAA_U13B_Jav,1,2),\"G2\",IF(W23>=INDEX(AAA_U13B_Jav,1,3),\"G3\",IF(W23>=INDEX(AAA_U13B_Jav,1,4),\"G4\",0)))))","v":0},{"$f":"(LARGE((F23,I23,L23),1)+LARGE((O23,R23),1)+LARGE((U23,X23),1))","v":0},{"$f":"IF(AG23=0,\"\",RANK(Z23,AG$7:AG$41))","v":""},{"$f":"IF(Z23=0,\"\",RANK(Z23,Z$7:Z$41))","v":""},"",null,null,null,0]
[null,null,null,null,null,0,0,null,0,0,null,0,0,null,0,0,null,0,0,null,0,0,null,0,0,{"$f":"(LARGE((F24,I24,L24),1)+LARGE((O24,R24),1)+LARGE((U24,X24),1))","v":0},"","","",null,null,null,0]
[null,null,null,null,null,0,0,null,0,0,null,0,0,null,0,0,null,0,0,null,0,0,null,0,0,{"$f":"(LARGE((F25,I25,L25),1)+LARGE((O25,R25),1)+LARGE((U25,X25),1))","v":0},"","","",null,null,null,0]
[null,null,null,null,null,0,0,null,0,0,null,0,0,null,0,0,null,0,0,null,0,0,null,0,0,{"$f":"(LARGE((F26,I26,L26),1)+LARGE((O26,R26),1)+LARGE((U26,X26),1))","v":0},"","","",null,null,null,0]
[null,null,null,null,null,0,0,null,0,0,null,0,0,null,0,0,null,0,0,null,0,0,null,0,0,{"$f":"(LARGE((F27,I27,L27),1)+LARGE((O27,R27),1)+LARGE((U27,X27),1))","v":0},"","","",null,null,null,0]
[null,null,null,null,null,0,0,null,0,0,null,0,0,null,0,0,null,0,0,null,0,0,null,0,0,{"$f":"(LARGE((F28,I28,L28),1)+LARGE((O28,R28),1)+LARGE((U28,X28),1))","v":0},"","","",null,null,null,0]
[null,null,null,null,null,0,0,null,0,0,null,0,0,null,0,0,null,0,0,null,0,0,null,0,0,{"$f":"(LARGE((F29,I29,L29),1)+LARGE((O29,R29),1)+LARGE((U29,X29),1))","v":0},"","","",null,null,null,0]
[null,null,null,null,null,0,0,null,0,0,null,0,0,null,0,0,null,0,0,null,0,0,null,0,0,{"$f":"(LARGE((F30,I30,L30),1)+LARGE((O30,R30),1)+LARGE((U30,X30),1))","v":0},"","","",null,null,null,0]
[null,null,null,null,null,0,0,null,0,0,null,0,0,null,0,0,null,0,0,null,0,0,null,0,0,{"$f":"(LARGE((F31,I31,L31),1)+LARGE((O31,R31),1)+LARGE((U31,X31),1))","v":0},"","","",null,null,null,0]
[null,null,null,null,null,0,0,null,0,0,null,0,0,null,0,0,null,0,0,null,0,0,null,0,0,{"$f":"(LARGE((F32,I32,L32),1)+LARGE((O32,R32),1)+LARGE((U32,X32),1))","v":0},"","","",null,null,null,0]
[null,null,null,null,null,0,0,null,0,0,null,0,0,null,0,0,null,0,0,null,0,0,null,0,0,{"$f":"(LARGE((F33,I33,L33),1)+LARGE((O33,R33),1)+LARGE((U33,X33),1))","v":0},"","","",null,null,null,0]
[null,null,null,null,null,0,0,null,0,0,null,0,0,null,0,0,null,0,0,null,0,0,null,0,0,{"$f":"(LARGE((F34,I34,L34),1)+LARGE((O34,R34),1)+LARGE((U34,X34),1))","v":0},"","","",null,null,null,0]
[null,null,null,null,null,0,0,null,0,0,null,0,0,null,0,0,null,0,0,null,0,0,null,0,0,{"$f":"(LARGE((F35,I35,L35),1)+LARGE((O35,R35),1)+LARGE((U35,X35),1))","v":0},"","","",null,null,null,0]
[null,null,null,null,null,0,0,null,0,0,null,0,0,null,0,0,null,0,0,null,0,0,null,0,0,{"$f":"(LARGE((F36,I36,L36),1)+LARGE((O36,R36),1)+LARGE((U36,X36),1))","v":0},"","","",null,null,null,0]
[null,null,null,null,null,0,0,null,0,0,null,0,0,null,0,0,null,0,0,null,0,0,null,0,0,{"$f":"(LARGE((F37,I37,L37),1)+LARGE((O37,R37),1)+LARGE((U37,X37),1))","v":0},"","","",null,null,null,0]
[null,null,null,null,null,0,0,null,0,0,null,0,0,null,0,0,null,0,0,null,0,0,null,0,0,{"$f":"(LARGE((F38,I38,L38),1)+LARGE((O38,R38),1)+LARGE((U38,X38),1))","v":0},"","","",null,null,null,0]
[null,null,null,null,null,0,0,null,0,0,null,0,0,null,0,0,null,0,0,null,0,0,null,0,0,{"$f":"(LARGE((F39,I39,L39),1)+LARGE((O39,R39),1)+LARGE((U39,X39),1))","v":0},"","","",null,null,null,0]
[null,null,null,null,null,0,0,null,0,0,null,0,0,null,0,0,null,0,0,null,0,0,null,0,0,{"$f":"(LARGE((F40,I40,L40),1)+LARGE((O40,R40),1)+LARGE((U40,X40),1))","v":0},"","","",null,null,null,0]
[null,null,null,null,null,0,0,null,0,0,null,0,0,null,0,0,null,0,0,null,0,0,null,0,0,{"$f":"(LARGE((F41,I41,L41),1)+LARGE((O41,R41),1)+LARGE((U41,X41),1))","v":0},"","","",null,null,null,0]
[{"$f":"COUNTIF(Z7:Z41,\">0\")","v":15},"Open","Cheshire",{"$f":"SUMPRODUCT((D7:D27=\"C\")*(Z7:Z27>0))","v":13}]

{"sheet":"U13G Tri","index":4,"n_rows":42,"n_cols":34,"rows_kept":42,"cut":false,"hidden":false,"merged":[[0,0,0,28],[1,8,1,15],[3,25,3,26],[4,10,4,14]]}
[{"$f":"EventTitle","v":"CHESHIRE COUNTY ATHLETICS ASSOCIATION - Junior Multievent Championship, Macclesfield"}]
[null,null,null,null,null,null,null,null,"U13 Girls "]
[]
["Arranged by:",null,{"$f":"ArrangedBy","v":"Handforth W A A C"},null,null,null,null,"Scorer:",null,null,{"$f":"Scorer","v":"H Branthwaite"},null,null,null,null,null,null,null,null,null,null,null,null,"Date:",null,{"$f":"Date","v":"2015-09-13"}]
["Sponsored by:",null,{"$f":"Sponsor","v":"Jones Homes"},null,null,null,null,"Checked by:",null,null,"S Cathery & M Norman"]
["No.","Name","Club","Cheshire","100m","Score","Grade","70m\nHurdles","Score","Grade","800m","Score","Grade","Long\nJump","Score","Grade","High\nJump","Score","Grade","Shot","Score","Grade","Jav.","Score","Grade","Total\nScore\n3 events","Chesh\nPosit'n\n","Open\nPosit'n\n","Five\nStar\nAward",null,null,null,"Chesh\nOnly","Last Col"]
[45,"Simpson, Emma","Altrincham & District",null,15.4,{"$f":"IF(E7=\"DNF\",0,IF(E7=0,0,IF(E7<=14,VLOOKUP(E7,T_100m,15,TRUE),IF(E7<=15.2,VLOOKUP(E7,T_100m,15,TRUE),IF(E7<=21,VLOOKUP(E7-0.01,T_100m,15,TRUE)-1,0)))))","v":47},{"$f":"IF(F7=0,0,IF(E7<=INDEX(AAA_U13G_100m,1,1),\"G1\",IF(E7<=INDEX(AAA_U13G_100m,1,2),\"G2\",IF(E7<=INDEX(AAA_U13G_100m,1,3),\"G3\",IF(E7<=INDEX(AAA_U13G_100m,1,4),\"G4\",0)))))","v":0},null,{"$f":"IF(H7=\"DNF\",0,IF(H7=0,0,VLOOKUP(H7,T_70_Hurdles,7,TRUE)))","v":0},{"$f":"IF(I7=0,0,IF(H7<=INDEX(AAA_U13G_70mH,1,1),\"G1\",IF(H7<=INDEX(AAA_U13G_70mH,1,2),\"G2\",IF(H7<=INDEX(AAA_U13G_70mH,1,3),\"G3\",IF(H7<=INDEX(AAA_U13G_70mH,1,4),\"G4\",0)))))","v":0},null,{"$f":"IF(K7=\"DNF\",0,IF(K7=0,0,VLOOKUP(K7,T_800m,11,TRUE)-1))","v":0},{"$f":"IF(L7=0,0,IF(K7<=INDEX(AAA_U13G_800m,1,1),\"G1\",IF(K7<=INDEX(AAA_U13G_800m,1,2),\"G2\",IF(K7<=INDEX(AAA_U13G_800m,1,3),\"G3\",IF(K7<=INDEX(AAA_U13G_800m,1,4),\"G4\",0)))))","v":0},3.89,{"$f":"IF(N7=\"NJ\",0,IF(N7=0,0,VLOOKUP(N7,T_Long,11,TRUE)))","v":67},{"$f":"IF(O7=0,0,IF(N7>=INDEX(AAA_U13G_LJ,1,1),\"G1\",IF(N7>=INDEX(AAA_U13G_LJ,1,2),\"G2\",IF(N7>=INDEX(AAA_U13G_LJ,1,3),\"G3\",IF(N7>=INDEX(AAA_U13G_LJ,1,4),\"G4\",0)))))","v":0},null,{"$f":"IF(Q7=\"NJ\",0,IF(Q7=0,0,VLOOKUP(Q7,T_High,12,TRUE)))","v":0},{"$f":"IF(R7=0,0,IF(Q7>=INDEX(AAA_U13G_HJ,1,1),\"G1\",IF(Q7>=INDEX(AAA_U13G_HJ,1,2),\"G2\",IF(Q7>=INDEX(AAA_U13G_HJ,1,3),\"G3\",IF(Q7>=INDEX(AAA_U13G_HJ,1,4),\"G4\",0)))))","v":0},null,{"$f":"IF(T7=\"NT\",0,IF(T7<2,0,VLOOKUP(T7,T_Shot,8,TRUE)))","v":0},{"$f":"IF(U7=0,0,IF(T7>=INDEX(AAA_U13G_Shot,1,1),\"G1\",IF(T7>=INDEX(AAA_U13G_Shot,1,2),\"G2\",IF(T7>=INDEX(AAA_U13G_Shot,1,3),\"G3\",IF(T7>=INDEX(AAA_U13G_Shot,1,4),\"G4\",0)))))","v":0},16.850000000000001,{"$f":"IF(W7=\"NT\",0,IF(W7<4,0,VLOOKUP(W7,T_Javlin,6,TRUE)))","v":52},{"$f":"IF(X7=0,0,IF(W7>=INDEX(AAA_U13G_Jav,1,1),\"G1\",IF(W7>=INDEX(AAA_U13G_Jav,1,2),\"G2\",IF(W7>=INDEX(AAA_U13G_Jav,1,3),\"G3\",IF(W7>=INDEX(AAA_U13G_Jav,1,4),\"G4\",0)))))","v":"G4"},{"$f":"(LARGE((F7,I7,L7),1)+LARGE((O7,R7),1)+LARGE((U7,X7),1))","v":166},{"$f":"IF(AG7=0,\"\",RANK(Z7,AG$7:AG$41))","v":""},{"$f":"IF(Z7=0,\"\",RANK(Z7,Z$7:Z$41))","v":10},{"$f":"IF(Z7<15,\"\",HLOOKUP(Z7,T_U13G_3_Events,5))","v":"5*"},null,null,null,{"$f":"IF(D7=\"C\",Z7,0)","v":0}]
[46,"Fowler, Olivia","Crewe & Nantwich","C",null,0,0,13.8,70,0,"00:02:53.400",63,0,3.31,48,0,null,0,0,null,0,0,11.46,30,0,{"$f":"(LARGE((F8,I8,L8),1)+LARGE((O8,R8),1)+LARGE((U8,X8),1))","v":148},8,12,"4*",null,null,null,148]
[47,"Lewis, Megan","East Cheshire H",null,null,0,0,null,0,0,"00:02:35.300",72,"G3",null,0,0,1.24,60,0,null,0,0,20,65,"G3",{"$f":"(LARGE((F9,I9,L9),1)+LARGE((O9,R9),1)+LARGE((U9,X9),1))","v":197},"",7,"5*",null,null,null,0]
[48,"Cathery, Isabel","Handforth WAAC","C",18.600000000000001,15,0,null,0,0,null,0,0,1.66,0,0,null,0,0,3.42,25,0,null,0,0,{"$f":"(LARGE((F10,I10,L10),1)+LARGE((O10,R10),1)+LARGE((U10,X10),1))","v":40},16,22,{"$error":"#N/A"},null,null,null,40]
[49,"Merry, Immy","Handforth WAAC","C",15,53,0,null,0,0,null,0,0,3.35,49,0,null,0,0,3.88,29,0,null,0,0,{"$f":"(LARGE((F11,I11,L11),1)+LARGE((O11,R11),1)+LARGE((U11,X11),1))","v":131},12,17,"4*",null,null,null,131]
[50,"Sheekey, Freya","Handforth WAAC","C",15.8,43,0,null,0,0,null,0,0,3.3,48,0,null,0,0,null,0,0,10.61,27,0,{"$f":"(LARGE((F12,I12,L12),1)+LARGE((O12,R12),1)+LARGE((U12,X12),1))","v":118},14,19,"3*",null,null,null,118]
[51,"Carey, Liliana","Macclesfield H","C",17,31,0,null,0,0,null,0,0,2.98,37,0,null,0,0,6.99,60,"G4",null,0,0,{"$f":"(LARGE((F13,I13,L13),1)+LARGE((O13,R13),1)+LARGE((U13,X13),1))","v":128},13,18,"4*",null,null,null,128]
[52,"Dutton, Poppy","Macclesfield H","C",15.1,51,0,null,0,0,null,0,0,null,0,0,1.18,54,0,null,0,0,12.19,33,0,{"$f":"(LARGE((F14,I14,L14),1)+LARGE((O14,R14),1)+LARGE((U14,X14),1))","v":138},10,15,"4*",null,null,null,138]
[53,"Greeney, Libby","Macclesfield H","C",15.5,46,0,null,0,0,"00:03:01.900",59,0,3.27,47,0,null,0,0,3.63,27,0,null,0,0,{"$f":"(LARGE((F15,I15,L15),1)+LARGE((O15,R15),1)+LARGE((U15,X15),1))","v":133},11,16,"4*",null,null,null,133]
[54,"Heslop, Sian","Macclesfield H","C",null,0,0,15.2,56,0,"00:02:35.900",72,"G4",3.28,47,0,null,0,0,null,0,0,11.01,29,0,{"$f":"(LARGE((F16,I16,L16),1)+LARGE((O16,R16),1)+LARGE((U16,X16),1))","v":148},8,12,"4*",null,null,null,148]
[55,"Dale, Alice","Sale H",null,null,0,0,12.6,82,"G3",null,0,0,null,0,0,1.3,66,"G3",null,0,0,20.8,68,"G3",{"$f":"(LARGE((F17,I17,L17),1)+LARGE((O17,R17),1)+LARGE((U17,X17),1))","v":216},"",3,"5*",null,null,null,0]
[56,"Whittaker, Scarlett","Sale H","C",null,0,0,12.4,84,"G3",null,0,0,3.99,70,"G4",null,0,0,7.84,69,"G2",null,0,0,{"$f":"(LARGE((F18,I18,L18),1)+LARGE((O18,R18),1)+LARGE((U18,X18),1))","v":223},2,2,"5*",null,null,null,223]
[57,"Burgess, Lauren","Stockport H",null,null,0,0,14.1,67,0,"00:02:54.400",62,0,3.58,57,0,null,0,0,null,0,0,11.95,32,0,{"$f":"(LARGE((F19,I19,L19),1)+LARGE((O19,R19),1)+LARGE((U19,X19),1))","v":156},"",11,"4*",null,null,null,0]
[58,"Martin, Millie","Stockport H",null,20,6,0,null,0,0,"00:03:42.800",38,0,2.34,16,0,null,0,0,2.5299999999999998,16,0,null,0,0,{"$f":"(LARGE((F20,I20,L20),1)+LARGE((O20,R20),1)+LARGE((U20,X20),1))","v":70},"",21,"1*",null,null,null,0]
[59,"Wild, Evie","Stockport H",null,null,0,0,null,0,0,"00:02:40.600",69,"G4",2.81,31,0,null,0,0,null,0,0,13.92,40,0,{"$f":"(LARGE((F21,I21,L21),1)+LARGE((O21,R21),1)+LARGE((U21,X21),1))","v":140},"",14,"4*",null,null,null,0]
[60,"Cartwright, Abigail","West Cheshire","C",16.2,39,0,null,0,0,"00:02:59.200",60,0,2.97,37,0,null,0,0,null,0,0,8.4700000000000006,19,0,{"$f":"(LARGE((F22,I22,L22),1)+LARGE((O22,R22),1)+LARGE((U22,X22),1))","v":116},15,20,"3*",null,null,null,116]
[61,"Crayston, Anna","West Cheshire","C",null,0,0,null,0,0,"00:02:31.100",74,"G2",4.71,78,"G1",null,0,0,5.76,48,0,null,0,0,{"$f":"(LARGE((F23,I23,L23),1)+LARGE((O23,R23),1)+LARGE((U23,X23),1))","v":200},5,6,"5*",null,null,null,200]
[62,"Hall, Jessica","West Cheshire","C",14.9,55,0,null,0,0,null,0,0,3.6,58,0,null,0,0,null,0,0,20.63,67,"G3",{"$f":"(LARGE((F24,I24,L24),1)+LARGE((O24,R24),1)+LARGE((U24,X24),1))","v":180},7,9,"5*",null,null,null,180]
[63,"Jayaram, Mimi","West Cheshire","C",null,0,0,null,0,0,null,0,0,null,0,0,null,0,0,null,0,0,null,0,0,{"$f":"(LARGE((F25,I25,L25),1)+LARGE((O25,R25),1)+LARGE((U25,X25),1))","v":0},"","","",null,null,null,0]
[64,"Jones, Lauren Eve","West Cheshire","C",14.9,55,0,null,0,0,null,0,0,null,0,0,1.3,66,"G3",null,0,0,18.79,60,"G4",{"$f":"(LARGE((F26,I26,L26),1)+LARGE((O26,R26),1)+LARGE((U26,X26),1))","v":181},6,8,"5*",null,null,null,181]
[65,"Misantoni, Emily","West Cheshire","C",13.7,76,"G2",null,0,0,"00:02:28.300",76,"G1",null,0,0,1.36,72,"G2",7.46,65,"G3",null,0,0,{"$f":"(LARGE((F27,I27,L27),1)+LARGE((O27,R27),1)+LARGE((U27,X27),1))","v":213},3,4,"5*",null,null,null,213]
[66,"Pawlett, Abigail","West Cheshire","C",null,0,0,11.2,96,"G1",null,0,0,null,0,0,1.39,75,"G2",9.42,78,"G1",null,0,0,{"$f":"(LARGE((F28,I28,L28),1)+LARGE((O28,R28),1)+LARGE((U28,X28),1))","v":249},1,1,"5*",null,null,null,249]
[67,"Tipping, Evie","West Cheshire","C",null,0,0,12.9,79,"G4","00:02:51.800",64,0,null,0,0,1.27,63,"G4",8.1,71,"G2",null,0,0,{"$f":"(LARGE((F29,I29,L29),1)+LARGE((O29,R29),1)+LARGE((U29,X29),1))","v":213},3,4,"5*",null,null,null,213]
[null,null,null,null,null,0,0,null,0,0,null,0,0,null,0,0,null,0,0,null,0,0,null,0,0,{"$f":"(LARGE((F30,I30,L30),1)+LARGE((O30,R30),1)+LARGE((U30,X30),1))","v":0},"","","",null,null,null,0]
[null,null,null,null,null,0,0,null,0,0,null,0,0,null,0,0,null,0,0,null,0,0,null,0,0,{"$f":"(LARGE((F31,I31,L31),1)+LARGE((O31,R31),1)+LARGE((U31,X31),1))","v":0},"","","",null,null,null,0]
[null,null,null,null,null,0,0,null,0,0,null,0,0,null,0,0,null,0,0,null,0,0,null,0,0,{"$f":"(LARGE((F32,I32,L32),1)+LARGE((O32,R32),1)+LARGE((U32,X32),1))","v":0},"","","",null,null,null,0]
[null,null,null,null,null,0,0,null,0,0,null,0,0,null,0,0,null,0,0,null,0,0,null,0,0,{"$f":"(LARGE((F33,I33,L33),1)+LARGE((O33,R33),1)+LARGE((U33,X33),1))","v":0},"","","",null,null,null,0]
[null,null,null,null,null,0,0,null,0,0,null,0,0,null,0,0,null,0,0,null,0,0,null,0,0,{"$f":"(LARGE((F34,I34,L34),1)+LARGE((O34,R34),1)+LARGE((U34,X34),1))","v":0},"","","",null,null,null,0]
[null,null,null,null,null,0,0,null,0,0,null,0,0,null,0,0,null,0,0,null,0,0,null,0,0,{"$f":"(LARGE((F35,I35,L35),1)+LARGE((O35,R35),1)+LARGE((U35,X35),1))","v":0},"","","",null,null,null,0]
[null,null,null,null,null,0,0,null,0,0,null,0,0,null,0,0,null,0,0,null,0,0,null,0,0,{"$f":"(LARGE((F36,I36,L36),1)+LARGE((O36,R36),1)+LARGE((U36,X36),1))","v":0},"","","",null,null,null,0]
[null,null,null,null,null,0,0,null,0,0,null,0,0,null,0,0,null,0,0,null,0,0,null,0,0,{"$f":"(LARGE((F37,I37,L37),1)+LARGE((O37,R37),1)+LARGE((U37,X37),1))","v":0},"","","",null,null,null,0]
[null,null,null,null,null,0,0,null,0,0,null,0,0,null,0,0,null,0,0,null,0,0,null,0,0,{"$f":"(LARGE((F38,I38,L38),1)+LARGE((O38,R38),1)+LARGE((U38,X38),1))","v":0},"","","",null,null,null,0]
[null,null,null,null,null,0,0,null,0,0,null,0,0,null,0,0,null,0,0,null,0,0,null,0,0,{"$f":"(LARGE((F39,I39,L39),1)+LARGE((O39,R39),1)+LARGE((U39,X39),1))","v":0},"","","",null,null,null,0]
[null,null,null,null,null,0,0,null,0,0,null,0,0,null,0,0,null,0,0,null,0,0,null,0,0,{"$f":"(LARGE((F40,I40,L40),1)+LARGE((O40,R40),1)+LARGE((U40,X40),1))","v":0},"","","",null,null,null,0]
[null,null,null,null,null,0,0,null,0,0,null,0,0,null,0,0,null,0,0,null,0,0,null,0,0,{"$f":"(LARGE((F41,I41,L41),1)+LARGE((O41,R41),1)+LARGE((U41,X41),1))","v":0},"","","",null,null,null,0]
[{"$f":"COUNTIF(Z7:Z41,\">0\")","v":22},"Open","Cheshire",{"$f":"SUMPRODUCT((D7:D41=\"C\")*(Z7:Z41>0))","v":16}]

{"sheet":"U15B Pent","index":5,"n_rows":36,"n_cols":29,"rows_kept":36,"cut":false,"hidden":false,"merged":[[0,0,0,21],[1,7,1,11],[3,19,3,20],[4,10,4,13]]}
[{"$f":"EventTitle","v":"CHESHIRE COUNTY ATHLETICS ASSOCIATION - Junior Multievent Championship, Macclesfield"}]
[null,null,null,null,null,null,null,"U15 Boys Pentathlon"]
[]
["Arranged by:",null,{"$f":"ArrangedBy","v":"Handforth W A A C"},null,null,null,null,"Scorer:",null,null,{"$f":"Scorer","v":"H Branthwaite"},null,null,null,null,null,null,"Date:",null,{"$f":"Date","v":"2015-09-13"}]
["Sponsored by:",null,{"$f":"Sponsor","v":"Jones Homes"},null,null,null,null,"Checked by:",null,null,"S Cathery & M Norman"]
["No.","Name","Club","Cheshire","80m\nHurdles","Points","Grade","800m","Points","Grade","Long\nJump","Points","Grade","High\nJump","Points","Grade","Shot","Points","Grade","Total\nPoints","Chesh\nPosit'n\n","Open\nPosit'n\n","Five\nStar\nAward",null,null,null,null,"Chesh\nOnly","Last Col"]
[102,"Henshaw, Jamie","Handforth WAAC","C",19.399999999999999,{"$f":"IF(E7=\"DNF\",0,IF(E7=0,0,ROUNDDOWN(INDEX(ESAA_U13B_80mH,1,3)*(INDEX(ESAA_U13B_80mH,1,4)-E7-0.24)^INDEX(ESAA_U13B_80mH,1,5),0)))","v":110},{"$f":"IF(F7=0,0,IF(E7<=INDEX(AAA_U15B_80mH,1,1),\"G1\",IF(E7<=INDEX(AAA_U15B_80mH,1,2),\"G2\",IF(E7<=INDEX(AAA_U15B_80mH,1,3),\"G3\",IF(E7<=INDEX(AAA_U15B_80mH,1,4),\"G4\",0)))))","v":0},"00:03:29.300",0,{"$f":"IF(I7=0,0,IF(H7<=INDEX(AAA_U15B_800m,1,1),\"G1\",IF(H7<=INDEX(AAA_U15B_800m,1,2),\"G2\",IF(H7<=INDEX(AAA_U15B_800m,1,3),\"G3\",IF(H7<=INDEX(AAA_U15B_800m,1,4),\"G4\",0)))))","v":0},3.11,{"$f":"IF(K7=\"NJ\",0,IF(K7=0,0,ROUNDDOWN(INDEX(MP_LJ,1,3)*(K7*100-INDEX(MP_LJ,1,4))^INDEX(MP_LJ,1,5),0)))","v":79},{"$f":"IF(L7=0,0,IF(K7>=INDEX(AAA_U15B_LJ,1,1),\"G1\",IF(K7>=INDEX(AAA_U15B_LJ,1,2),\"G2\",IF(K7>=INDEX(AAA_U15B_LJ,1,3),\"G3\",IF(K7>=INDEX(AAA_U15B_LJ,1,4),\"G4\",0)))))","v":0},"NJ",{"$f":"IF(N7=\"NJ\",0,IF(N7=0,0,ROUNDDOWN(INDEX(MP_HJ,1,3)*(N7*100-INDEX(MP_HJ,1,4))^INDEX(MP_HJ,1,5),0)))","v":0},{"$f":"IF(O7=0,0,IF(N7>=INDEX(AAA_U15B_HJ,1,1),\"G1\",IF(N7>=INDEX(AAA_U15B_HJ,1,2),\"G2\",IF(N7>=INDEX(AAA_U15B_HJ,1,3),\"G3\",IF(N7>=INDEX(AAA_U15B_HJ,1,4),\"G4\",0)))))","v":0},"NT",{"$f":"IF(Q7=\"NT\",0,IF(Q7=0,0,ROUNDDOWN(INDEX(MP_Shot,1,3)*(Q7-INDEX(MP_Shot,1,4))^INDEX(MP_Shot,1,5),0)))","v":0},{"$f":"IF(R7=0,0,IF(Q7>=INDEX(AAA_U15B_Shot,1,1),\"G1\",IF(Q7>=INDEX(AAA_U15B_Shot,1,2),\"G2\",IF(Q7>=INDEX(AAA_U15B_Shot,1,3),\"G3\",IF(Q7>=INDEX(AAA_U15B_Shot,1,4),\"G4\",0)))))","v":0},{"$f":"SUM(F7,I7,L7,O7,,R7)","v":189},{"$f":"IF(AB7=0,\"\",RANK(T7,AB$7:AB$35))","v":6},{"$f":"IF(T7=0,\"\",RANK(T7,T$7:T$35))","v":7},null,null,null,null,null,{"$f":"IF(D7=\"C\",T7,0)","v":189}]
[103,"Carey, Joshua","Macclesfield H","C",null,0,0,null,{"$f":"IF(H8=\"DNF\",0,IF(H8=0,0,ROUNDDOWN(INDEX(ESAA_U17M_800m,1,3)*(INDEX(ESAA_U17M_800m,1,4)-H8*24*60*60)^INDEX(ESAA_U17M_800m,1,5),0)))","v":0},0,null,0,0,null,0,0,null,0,0,0,"","",{"$f":"IF(T8<15,\"\",HLOOKUP(T8,T_U15B_3_Events,7))","v":""},null,null,null,null,0]
[104,"Boyd, Harry","Sale H","C",14.3,457,0,"00:02:34.500",{"$f":"IF(H9=\"DNF\",0,IF(H9=0,0,ROUNDDOWN(INDEX(ESAA_U17M_800m,1,3)*(INDEX(ESAA_U17M_800m,1,4)-H9*24*60*60)^INDEX(ESAA_U17M_800m,1,5),0)))","v":270},0,4.7699999999999996,339,0,1.38,303,0,8.77,412,0,1781,3,3,"5*",null,null,null,null,1781]
[105,"Connor, Matthew","Stockport H",null,null,0,0,null,0,0,null,0,0,null,0,0,null,0,0,0,"","","",null,null,null,null,0]
[106,"Ramirez, Emilio","Stockport H",null,15.9,325,0,"00:02:36.100",253,0,3.86,184,0,1.23,206,0,8.2799999999999994,383,0,1351,"",5,"5*",null,null,null,null,0]
[107,"Stewart, Cameron","Stockport H","C",13.3,549,"G4","00:02:52.500",106,0,5.04,390,"G4",1.8,627,"G1",8.5399999999999991,398,0,2070,2,2,"5*",null,null,null,null,2070]
[108,"Herrington, Joshua","Warrington","C",12.3,649,"G2","00:02:28",346,0,4.91,365,0,1.65,504,"G2",6.19,260,0,2124,1,1,"5*",null,null,null,null,2124]
[109,"Bowyer, Finnian","West Cheshire","C",14.6,430,0,"00:02:52.800",104,0,3.95,198,0,1.44,345,0,7.29,324,0,1401,4,4,"5*",null,null,null,null,1401]
[110,"Mason, Alexander","West Cheshire","C",18.2,172,0,"00:02:21.300",433,0,3.49,129,0,0,0,0,6.64,286,0,1020,5,6,"5*",null,null,null,null,1020]
[null,null,null,null,null,0,0,null,0,0,null,0,0,null,0,0,null,0,0,0,"","",null,null,null,null,null,0]
[null,null,null,null,null,0,0,null,0,0,null,0,0,null,0,0,null,0,0,0,"","",{"$f":"IF(T17<15,\"\",HLOOKUP(T17,T_U15B_3_Events,7))","v":""},null,null,null,null,0]
[null,null,null,null,null,0,0,null,0,0,null,0,0,null,0,0,null,0,0,0,"","","",null,null,null,null,0]
[null,null,null,null,null,0,0,null,0,0,null,0,0,null,0,0,null,0,0,0,"","","",null,null,null,null,0]
[null,null,null,null,null,0,0,null,0,0,null,0,0,null,0,0,null,0,0,0,"","","",null,null,null,null,0]
[null,null,null,null,null,0,0,null,0,0,null,0,0,null,0,0,null,0,0,0,"","","",null,null,null,null,0]
[null,null,null,null,null,0,0,null,0,0,null,0,0,null,0,0,null,0,0,0,"","","",null,null,null,null,0]
[null,null,null,null,null,0,0,null,0,0,null,0,0,null,0,0,null,0,0,0,"","","",null,null,null,null,0]
[null,null,null,null,null,0,0,null,0,0,null,0,0,null,0,0,null,0,0,0,"","","",null,null,null,null,0]
[null,null,null,null,null,0,0,null,0,0,null,0,0,null,0,0,null,0,0,0,"","","",null,null,null,null,0]
[null,null,null,null,null,0,0,null,0,0,null,0,0,null,0,0,null,0,0,0,"","","",null,null,null,null,0]
[null,null,null,null,null,0,0,null,0,0,null,0,0,null,0,0,null,0,0,0,"","","",null,null,null,null,0]
[null,null,null,null,null,0,0,null,0,0,null,0,0,null,0,0,null,0,0,0,"","","",null,null,null,null,0]
[null,null,null,null,null,0,0,null,0,0,null,0,0,null,0,0,null,0,0,0,"","","",null,null,null,null,0]
[null,null,null,null,null,0,0,null,0,0,null,0,0,null,0,0,null,0,0,0,"","","",null,null,null,null,0]
[null,null,null,null,null,0,0,null,0,0,null,0,0,null,0,0,null,0,0,0,"","","",null,null,null,null,0]
[null,null,null,null,null,0,0,null,0,0,null,0,0,null,0,0,null,0,0,0,"","","",null,null,null,null,0]
[null,null,null,null,null,0,0,null,0,0,null,0,0,null,0,0,null,0,0,0,"","","",null,null,null,null,0]
[null,null,null,null,null,0,0,null,0,0,null,0,0,null,0,0,null,0,0,0,"","","",null,null,null,null,0]
[null,null,null,null,null,0,0,null,0,0,null,0,0,null,0,0,null,0,0,0,"","","",null,null,null,null,0]
[{"$f":"COUNTIF(T7:T35,\">0\")","v":7},"Open","Cheshire",{"$f":"SUMPRODUCT((D7:D35=\"C\")*(T7:T35>0))","v":6}]

{"sheet":"U15G Pent","index":6,"n_rows":36,"n_cols":29,"rows_kept":36,"cut":false,"hidden":false,"merged":[[0,0,0,21],[1,7,1,11],[3,19,3,20],[4,10,4,13]]}
[{"$f":"EventTitle","v":"CHESHIRE COUNTY ATHLETICS ASSOCIATION - Junior Multievent Championship, Macclesfield"}]
[null,null,null,null,null,null,null,"U15 Girls Pentathlon"]
[]
["Arranged by:",null,{"$f":"ArrangedBy","v":"Handforth W A A C"},null,null,null,null,"Scorer:",null,null,{"$f":"Scorer","v":"H Branthwaite"},null,null,null,null,null,null,"Date:",null,{"$f":"Date","v":"2015-09-13"}]
["Sponsored by:",null,{"$f":"Sponsor","v":"Jones Homes"},null,null,null,null,"Checked by:",null,null,"S Cathery & M Norman"]
["No.","Name","Club","Cheshire","75m\nHurdles","Points","Grade","800m","Points","Grade","Long\nJump","Points","Grade","High\nJump","Points","Grade","Shot","Points","Grade","Total\nPoints","Chesh\nPosit'n\n","Open\nPosit'n\n","Five\nStar\nAward",null,null,null,null,"Chesh\nOnly","Last Col"]
[84,"Atkinson, Amelia","Crewe & Nantwich","C",13.3,{"$f":"IF(E7=\"DNF\",0,IF(E7=0,0,IF(E7>22.7,\"0\",VLOOKUP(ROUNDUP(E7,1),T_ESAA_U15G_75mH,2,TRUE))))","v":539},{"$f":"IF(F7=0,0,IF(E7<=INDEX(AAA_U15G_75mH,1,1),\"G1\",IF(E7<=INDEX(AAA_U15G_75mH,1,2),\"G2\",IF(E7<=INDEX(AAA_U15G_75mH,1,3),\"G3\",IF(E7<=INDEX(AAA_U15G_75mH,1,4),\"G4\",0)))))","v":"G4"},"00:02:39.600",{"$f":"IF(H7=\"DNF\",0,IF(H7=0,0,ROUNDDOWN(INDEX(WP_800m,1,3)*(INDEX(WP_800m,1,4)-H7*24*60*60)^INDEX(WP_800m,1,5),0)))","v":577},{"$f":"IF(I7=0,0,IF(H7<=INDEX(AAA_U15G_800m,1,1),\"G1\",IF(H7<=INDEX(AAA_U15G_800m,1,2),\"G2\",IF(H7<=INDEX(AAA_U15G_800m,1,3),\"G3\",IF(H7<=INDEX(AAA_U15G_800m,1,4),\"G4\",0)))))","v":0},3.83,{"$f":"IF(K7=\"NJ\",0,IF(K7=0,0,ROUNDDOWN(INDEX(WP_LJ,1,3)*(K7*100-INDEX(WP_LJ,1,4))^INDEX(WP_LJ,1,5),0)))","v":270},{"$f":"IF(L7=0,0,IF(K7>=INDEX(AAA_U15G_LJ,1,1),\"G1\",IF(K7>=INDEX(AAA_U15G_LJ,1,2),\"G2\",IF(K7>=INDEX(AAA_U15G_LJ,1,3),\"G3\",IF(K7>=INDEX(AAA_U15G_LJ,1,4),\"G4\",0)))))","v":0},1.39,{"$f":"IF(N7=\"NJ\",0,IF(N7=0,0,ROUNDDOWN(INDEX(WP_HJ,1,3)*(N7*100-INDEX(WP_HJ,1,4))^INDEX(WP_HJ,1,5),0)))","v":502},{"$f":"IF(O7=0,0,IF(N7>=INDEX(AAA_U15G_HJ,1,1),\"G1\",IF(N7>=INDEX(AAA_U15G_HJ,1,2),\"G2\",IF(N7>=INDEX(AAA_U15G_HJ,1,3),\"G3\",IF(N7>=INDEX(AAA_U15G_HJ,1,4),\"G4\",0)))))","v":0},6.65,{"$f":"IF(Q7=\"NT\",0,IF(Q7=0,0,ROUNDDOWN(INDEX(WP_Shot,1,3)*(Q7-INDEX(WP_Shot,1,4))^INDEX(WP_Shot,1,5),0)))","v":313},{"$f":"IF(R7=0,0,IF(Q7>=INDEX(AAA_U15G_Shot,1,1),\"G1\",IF(Q7>=INDEX(AAA_U15G_Shot,1,2),\"G2\",IF(Q7>=INDEX(AAA_U15G_Shot,1,3),\"G3\",IF(Q7>=INDEX(AAA_U15G_Shot,1,4),\"G4\",0)))))","v":0},{"$f":"SUM(F7,I7,L7,O7,,R7)","v":2201},{"$f":"IF(AB7=0,\"\",RANK(T7,AB$7:AB$35))","v":3},{"$f":"IF(T7=0,\"\",RANK(T7,T$7:T$35))","v":5},null,null,null,null,null,{"$f":"IF(D7=\"C\",T7,0)","v":2201}]
[85,"Leydon, Zoe","Crewe & Nantwich","C",14.6,430,0,"00:02:35.800",622,0,3.9,285,0,1.24,350,0,5.98,270,0,1957,6,10,{"$f":"IF(T8<15,\"\",HLOOKUP(T8,T_U15B_3_Events,7))","v":"5*"},null,null,null,null,1957]
[86,"Palin, Jennifer","Crewe & Nantwich","C",16.3,307,0,"00:03:24.200",173,0,3.81,265,0,1.33,439,0,6.33,292,0,1476,9,14,null,null,null,null,null,1476]
[87,"Farrell, Alfi","East Cheshire H",null,13.4,530,"G4","00:02:51.600",447,0,4.07,324,0,1.33,439,0,7.96,397,0,2137,"",7,{"$f":"IF(T10<15,\"\",HLOOKUP(T10,T_U15B_3_Events,7))","v":"5*"},null,null,null,null,0]
[88,"Skidmore, Chloe","East Cheshire H",null,14,480,0,"00:02:37.700",600,0,4.2300000000000004,362,0,1.24,350,0,6.85,325,0,2117,"",8,"5*",null,null,null,null,0]
[89,"Keep, Morgan","Handforth WAAC","C",20,109,0,"00:03:37.300",97,0,2.65,53,0,1.0900000000000001,214,0,5.04,211,0,684,10,15,"5*",null,null,null,null,684]
[90,"Hickey, Laura","Leigh H",null,12.1,663,"G2","00:02:43.900",529,0,4.9000000000000004,532,"G2",1.42,534,"G4",6.18,283,0,2541,"",2,"5*",null,null,null,null,0]
[91,"McLean, Sanna","Leigh H",null,null,0,0,null,0,0,null,0,0,null,0,0,null,0,0,0,"","","",null,null,null,null,0]
[92,"Cobey, Eve","Macclesfield H","C",17.600000000000001,228,0,"00:02:47.800",487,0,4.04,317,0,1.24,350,0,5.43,235,0,1617,8,13,"5*",null,null,null,null,1617]
[93,"Elliot, Josephine","Macclesfield H","C",18.2,196,0,"00:02:36.700",611,0,4.57,446,"G4",1.27,379,0,7.28,353,0,1985,5,9,null,null,null,null,null,1985]
[94,"Harrison, Chloe","Macclesfield H","C",null,0,0,null,0,0,null,0,0,null,0,0,null,0,0,0,"","",null,null,null,null,null,0]
[95,"Kyriacou, Sam","Macclesfield H","C",16.7,282,0,"00:02:35.600",624,0,3.64,229,0,1.21,321,0,5.76,256,0,1712,7,12,5.04,null,null,null,null,1712]
[96,"Lowery, Emily","Macclesfield H","C",14.7,422,0,"00:02:26.100",743,"G4",3.89,283,0,1.33,439,0,5.8,259,0,2146,4,6,{"$f":"IF(T19<15,\"\",HLOOKUP(T19,T_U15B_3_Events,7))","v":"5*"},null,null,null,null,2146]
[97,"McTiffin, Lois","Sale H","C",12.7,599,"G3","00:02:39.800",575,0,4.6500000000000004,466,"G4",1.48,599,"G3",9.56,501,"G3",2740,1,1,{"$f":"IF(T20<15,\"\",HLOOKUP(T20,T_U15B_3_Events,7))","v":"5*"},null,null,null,null,2740]
[98,"Giller, Alice","Stockport H","C",null,0,0,null,0,0,null,0,0,null,0,0,null,0,0,0,"","",{"$f":"IF(T21<15,\"\",HLOOKUP(T21,T_U15B_3_Events,7))","v":""},null,null,null,null,0]
[99,"Giller, Catherine","Stockport H","C",12.4,630,"G3","00:02:51.400",449,0,4.68,474,"G4",1.27,379,0,6.34,293,0,2225,2,4,{"$f":"IF(T22<15,\"\",HLOOKUP(T22,T_U15B_3_Events,7))","v":"5*"},null,null,null,null,2225]
[100,"Morrison, Tasmin","Trafford ",null,14.7,422,0,"00:02:58.900",375,0,4.05,319,0,1.24,350,0,5.95,268,0,1734,"",11,null,null,null,null,null,0]
[101,"Rowlands, Emma","Wirral AC",null,13.3,539,"G4","00:02:48.500",479,0,4.2699999999999996,371,0,1.36,470,0,9.57,501,"G3",2360,"",3,{"$f":"IF(T24<15,\"\",HLOOKUP(T24,T_U15B_3_Events,7))","v":"5*"},null,null,null,null,0]
[null,null,null,null,null,0,0,null,0,0,null,0,0,null,0,0,null,0,0,0,"","","",null,null,null,null,0]
[null,null,null,null,null,0,0,null,0,0,null,0,0,null,0,0,null,0,0,0,"","","",null,null,null,null,0]
[null,null,null,null,null,0,0,null,0,0,null,0,0,null,0,0,null,0,0,0,"","","",null,null,null,null,0]
[null,null,null,null,null,0,0,null,0,0,null,0,0,null,0,0,null,0,0,0,"","","",null,null,null,null,0]
[null,null,null,null,null,0,0,null,0,0,null,0,0,null,0,0,null,0,0,0,"","","",null,null,null,null,0]
[null,null,null,null,null,0,0,null,0,0,null,0,0,null,0,0,null,0,0,0,"","","",null,null,null,null,0]
[null,null,null,null,null,0,0,null,0,0,null,0,0,null,0,0,null,0,0,0,"","","",null,null,null,null,0]
[null,null,null,null,null,0,0,null,0,0,null,0,0,null,0,0,null,0,0,0,"","","",null,null,null,null,0]
[null,null,null,null,null,0,0,null,0,0,null,0,0,null,0,0,null,0,0,0,"","","",null,null,null,null,0]
[null,null,null,null,null,0,0,null,0,0,null,0,0,null,0,0,null,0,0,0,"","","",null,null,null,null,0]
[null,null,null,null,null,0,0,null,0,0,null,0,0,null,0,0,null,0,0,0,null,null,null,null,null,null,null,0]
[{"$f":"COUNTIF(T7:T35,\">0\")","v":15},"Open","Cheshire",{"$f":"SUMPRODUCT((D7:D35=\"C\")*(T7:T35>0))","v":10}]

{"sheet":"U17W Pent","index":7,"n_rows":22,"n_cols":29,"rows_kept":22,"cut":false,"hidden":false,"merged":[[0,0,0,22],[1,7,1,11],[3,19,3,20],[4,10,4,13]]}
[{"$f":"EventTitle","v":"CHESHIRE COUNTY ATHLETICS ASSOCIATION - Junior Multievent Championship, Macclesfield"}]
[null,null,null,null,null,null,null,"U17 Women Pentathlon"]
[]
["Arranged by:",null,{"$f":"ArrangedBy","v":"Handforth W A A C"},null,null,null,null,"Scorer:",null,null,{"$f":"Scorer","v":"H Branthwaite"},null,null,null,null,null,null,"Date:",null,{"$f":"Date","v":"2015-09-13"}]
["Sponsored by:",null,{"$f":"Sponsor","v":"Jones Homes"},null,null,null,null,"Checked by:",null,null,"S Cathery & M Norman"]
["No.","Name","Club","Cheshire","80m\nHurdles","Points","Grade","Shot","Points","Grade","Long\nJump","Points","Grade","High\nJump","Points","Grade","800m","Points","Grade","Total\nPoints","Chesh\nPosit'n\n","Open\nPosit'n\n","Five\nStar\nAward",null,null,null,null,"Chesh\nOnly","Last Col"]
[111,"Hughes, Liberty","Crewe & Nantwich","C",13.1,{"$f":"IF(E7=\"DNF\",0,IF(E7=0,0,IF(E7>23.7,\"0\",VLOOKUP(ROUNDUP(E7,1),T_ESAA_U17G_80mH,2,TRUE))))","v":663},{"$f":"IF(F7=0,0,IF(E7<=INDEX(AAA_U17W_80mH,1,1),\"G1\",IF(E7<=INDEX(AAA_U17W_80mH,1,2),\"G2\",IF(E7<=INDEX(AAA_U17W_80mH,1,3),\"G3\",IF(E7<=INDEX(AAA_U17W_80mH,1,4),\"G4\",0)))))","v":"G4"},8.3699999999999992,{"$f":"IF(H7=\"NT\",0,IF(H7=0,0,ROUNDDOWN(INDEX(WP_Shot,1,3)*(H7-INDEX(WP_Shot,1,4))^INDEX(WP_Shot,1,5),0)))","v":423},{"$f":"IF(I7=0,0,IF(H7>=INDEX(AAA_U17W_Shot,1,1),\"G1\",IF(H7>=INDEX(AAA_U17W_Shot,1,2),\"G2\",IF(H7>=INDEX(AAA_U17W_Shot,1,3),\"G3\",IF(H7>=INDEX(AAA_U17W_Shot,1,4),\"G4\",0)))))","v":0},5.25,{"$f":"IF(K7=\"NJ\",0,IF(K7=0,0,ROUNDDOWN(INDEX(WP_LJ,1,3)*(K7*100-INDEX(WP_LJ,1,4))^INDEX(WP_LJ,1,5),0)))","v":628},{"$f":"IF(L7=0,0,IF(K7>=INDEX(AAA_U17W_LJ,1,1),\"G1\",IF(K7>=INDEX(AAA_U17W_LJ,1,2),\"G2\",IF(K7>=INDEX(AAA_U17W_LJ,1,3),\"G3\",IF(K7>=INDEX(AAA_U17W_LJ,1,4),\"G4\",0)))))","v":"G2"},1.48,{"$f":"IF(N7=\"NJ\",0,IF(N7=0,0,ROUNDDOWN(INDEX(WP_HJ,1,3)*(N7*100-INDEX(WP_HJ,1,4))^INDEX(WP_HJ,1,5),0)))","v":599},{"$f":"IF(O7=0,0,IF(N7>=INDEX(AAA_U17W_HJ,1,1),\"G1\",IF(N7>=INDEX(AAA_U17W_HJ,1,2),\"G2\",IF(N7>=INDEX(AAA_U17W_HJ,1,3),\"G3\",IF(N7>=INDEX(AAA_U17W_HJ,1,4),\"G4\",0)))))","v":0},"00:02:35.600",{"$f":"IF(Q7=\"DNF\",0,IF(Q7=0,0,ROUNDDOWN(INDEX(WP_800m,1,3)*(INDEX(WP_800m,1,4)-Q7*24*60*60)^INDEX(WP_800m,1,5),0)))","v":624},{"$f":"IF(R7=0,0,IF(Q7<=INDEX(AAA_U17W_800m,1,1),\"G1\",IF(Q7<=INDEX(AAA_U17W_800m,1,2),\"G2\",IF(Q7<=INDEX(AAA_U17W_800m,1,3),\"G3\",IF(Q7<=INDEX(AAA_U17W_800m,1,4),\"G4\",0)))))","v":0},{"$f":"SUM(F7,I7,L7,O7,,R7)","v":2937},{"$f":"IF(AB7=0,\"\",RANK(T7,AB$7:AB$21))","v":1},{"$f":"IF(T7=0,\"\",RANK(T7,T$7:T$21))","v":1},{"$f":"IF(T7<15,\"\",HLOOKUP(T7,T_U13B_3_Events,5))","v":"5*"},null,null,null,null,{"$f":"IF(D7=\"C\",T7,0)","v":2937}]
[112,"Cooper, Katie","Manchester H",null,17,327,0,8.0299999999999994,401,0,3.85,274,0,1.1499999999999999,266,0,"00:02:46.600",500,0,1768,"",5,{"$f":"IF(T8<15,\"\",HLOOKUP(T8,T_U13B_3_Events,5))","v":"5*"},null,null,null,null,0]
[113,"Decker, Sophie","Stockport H","C",12.9,686,"G4",8.5,432,0,4.76,495,0,1.39,502,0,"00:02:36.100",618,0,2733,2,2,{"$f":"IF(T9<15,\"\",HLOOKUP(T9,T_U13B_3_Events,5))","v":"5*"},null,null,null,null,2733]
[114,"Jackson, Amy","Stockport H","C",13.7,599,0,7.05,338,0,4.49,426,0,1.39,502,0,"00:03:01",356,0,2221,4,4,null,null,null,null,null,2221]
[115,"Shaw, Hannah","Warrington","C",14.2,549,0,7.02,336,0,4.3,379,0,1.42,534,0,"00:02:49.600",468,0,2266,3,3,{"$f":"IF(T11<15,\"\",HLOOKUP(T11,T_U13B_3_Events,5))","v":"5*"},null,null,null,null,2266]
[null,null,null,null,null,0,0,null,0,0,null,0,0,null,0,0,null,0,0,0,"","","",null,null,null,null,0]
[null,null,null,null,null,0,0,null,0,0,null,0,0,null,0,0,null,0,0,0,"","","",null,null,null,null,0]
[null,null,null,null,null,0,0,null,0,0,null,0,0,null,0,0,null,0,0,0,"","","",null,null,null,null,0]
[null,null,null,null,null,0,0,null,0,0,null,0,0,null,0,0,null,0,0,0,"","","",null,null,null,null,0]
[null,null,null,null,null,0,0,null,0,0,null,0,0,null,0,0,null,0,0,0,"","","",null,null,null,null,0]
[null,null,null,null,null,0,0,null,0,0,null,0,0,null,0,0,null,0,0,0,"","","",null,null,null,null,0]
[null,null,null,null,null,0,0,null,0,0,null,0,0,null,0,0,null,0,0,0,"","","",null,null,null,null,0]
[null,null,null,null,null,0,0,null,0,0,null,0,0,null,0,0,null,0,0,0,"","","",null,null,null,null,0]
[null,null,null,null,null,0,0,null,0,0,null,0,0,null,0,0,null,0,0,0,"","","",null,null,null,null,0]
[null,null,null,null,null,0,0,null,0,0,null,0,0,null,0,0,null,0,0,0,"","","",null,null,null,null,0]
[{"$f":"COUNTIF(T7:T21,\">0\")","v":5},"Open","Cheshire",{"$f":"SUMPRODUCT((D7:D21=\"C\")*(T7:T21>0))","v":4}]

{"sheet":"U17M Pent","index":8,"n_rows":22,"n_cols":29,"rows_kept":22,"cut":false,"hidden":false,"merged":[[0,0,0,22],[1,7,1,11],[3,19,3,20],[4,10,4,13]]}
[{"$f":"EventTitle","v":"CHESHIRE COUNTY ATHLETICS ASSOCIATION - Junior Multievent Championship, Macclesfield"}]
[null,null,null,null,null,null,null,"U17 Men Pentathlon"]
[]
["Arranged by:",null,{"$f":"ArrangedBy","v":"Handforth W A A C"},null,null,null,null,"Scorer:",null,null,{"$f":"Scorer","v":"H Branthwaite"},null,null,null,null,null,null,"Date:",null,{"$f":"Date","v":"2015-09-13"}]
["Sponsored by:",null,{"$f":"Sponsor","v":"Jones Homes"},null,null,null,null,"Checked by:",null,null,"S Cathery & M Norman"]
["No.","Name","Club","Cheshire","100m\nHurdles","Points","Grade","Shot","Points","Grade","Long\nJump","Points","Grade","High\nJump","Points","Grade","800m","Points","Grade","Total\nPoints","Chesh\nPosit'n\n","Open\nPosit'n\n","Five\nStar\nAward",null,null,null,null,"Chesh\nOnly","Last Col"]
[116,"Palin, Lewis","Crewe & Nantwich","C",15.3,{"$f":"IF(E7=\"DNF\",0,IF(E7=0,0,ROUNDDOWN(INDEX(ESAA_U17M_100mH,1,3)*(INDEX(ESAA_U17M_100mH,1,4)-E7-0.24)^INDEX(ESAA_U17M_100mH,1,5),0)))","v":635},{"$f":"IF(E7=0,0,IF(E7<=INDEX(AAA_U17M_100mH,1,1),\"G1\",IF(E7<=INDEX(AAA_U17M_100mH,1,2),\"G2\",IF(E7<=INDEX(AAA_U17M_100mH,1,3),\"G3\",IF(E7<=INDEX(AAA_U17M_100mH,1,4),\"G4\",0)))))","v":"G4"},5.82,{"$f":"IF(H7=\"NT\",0,IF(H7=0,0,ROUNDDOWN(INDEX(MP_Shot,1,3)*(H7-INDEX(MP_Shot,1,4))^INDEX(MP_Shot,1,5),0)))","v":238},{"$f":"IF(I7=0,0,IF(H7>=INDEX(AAA_U17M_Shot,1,1),\"G1\",IF(H7>=INDEX(AAA_U17M_Shot,1,2),\"G2\",IF(H7>=INDEX(AAA_U17M_Shot,1,3),\"G3\",IF(H7>=INDEX(AAA_U17M_Shot,1,4),\"G4\",0)))))","v":0},5.53,{"$f":"IF(K7=\"NJ\",0,IF(K7=0,0,ROUNDDOWN(INDEX(MP_LJ,1,3)*(K7*100-INDEX(MP_LJ,1,4))^INDEX(MP_LJ,1,5),0)))","v":487},{"$f":"IF(L7=0,0,IF(K7>=INDEX(AAA_U17M_LJ,1,1),\"G1\",IF(K7>=INDEX(AAA_U17M_LJ,1,2),\"G2\",IF(K7>=INDEX(AAA_U17M_LJ,1,3),\"G3\",IF(K7>=INDEX(AAA_U17M_LJ,1,4),\"G4\",0)))))","v":0},1.5,{"$f":"IF(N7=\"NJ\",0,IF(N7=0,0,ROUNDDOWN(INDEX(MP_HJ,1,3)*(N7*100-INDEX(MP_HJ,1,4))^INDEX(MP_HJ,1,5),0)))","v":389},{"$f":"IF(O7=0,0,IF(N7>=INDEX(AAA_U17M_HJ,1,1),\"G1\",IF(N7>=INDEX(AAA_U17M_HJ,1,2),\"G2\",IF(N7>=INDEX(AAA_U17M_HJ,1,3),\"G3\",IF(N7>=INDEX(AAA_U17M_HJ,1,4),\"G4\",0)))))","v":0},"00:02:25.200",{"$f":"IF(Q7=\"DNF\",0,IF(Q7=0,0,ROUNDDOWN(INDEX(ESAA_U17M_800m,1,3)*(INDEX(ESAA_U17M_800m,1,4)-Q7*24*60*60)^INDEX(ESAA_U17M_800m,1,5),0)))","v":382},{"$f":"IF(Q7=0,0,IF(Q7<=INDEX(AAA_U17M_800m,1,1),\"G1\",IF(Q7<=INDEX(AAA_U17M_800m,1,2),\"G2\",IF(Q7<=INDEX(AAA_U17M_800m,1,3),\"G3\",IF(Q7<=INDEX(AAA_U17M_800m,1,4),\"G4\",0)))))","v":0},{"$f":"SUM(F7,I7,L7,O7,,R7)","v":2131},{"$f":"IF(AB7=0,\"\",RANK(T7,AB$7:AB$21))","v":3},{"$f":"IF(T7=0,\"\",RANK(T7,T$7:T$21))","v":3},{"$f":"IF(T7<15,\"\",HLOOKUP(T7,T_U13B_3_Events,5))","v":"5*"},null,null,null,null,{"$f":"IF(D7=\"C\",T7,0)","v":2131}]
[117,"Milligan, Ethan","West Cheshire","C",null,0,0,null,0,0,null,0,0,null,0,0,null,0,0,0,"","","",null,null,null,null,0]
[118,"Simpson, Harry","Macclesfield H","C",15.4,625,"G4",7.49,336,0,5.31,443,0,1.35,283,0,"00:02:10",601,0,2288,1,1,"5*",null,null,null,null,2288]
[119,"Roe, Franklyn","Crewe & Nantwich","C",16.3,537,0,8.2200000000000006,379,0,5.54,490,0,1.62,480,0,"00:02:32.300",295,0,2181,2,2,"5*",null,null,null,null,2181]
[null,null,null,null,null,0,0,null,0,0,null,0,0,null,0,0,null,0,0,0,"","","",null,null,null,null,0]
[null,null,null,null,null,0,0,null,0,0,null,0,0,null,0,0,null,0,0,0,"","","",null,null,null,null,0]
[null,null,null,null,null,0,0,null,0,0,null,0,0,null,0,0,null,0,0,0,"","","",null,null,null,null,0]
[null,null,null,null,null,0,0,null,0,0,null,0,0,null,0,0,null,0,0,0,"","","",null,null,null,null,0]
[null,null,null,null,null,0,0,null,0,0,null,0,0,null,0,0,null,0,0,0,"","","",null,null,null,null,0]
[null,null,null,null,null,0,0,null,0,0,null,0,0,null,0,0,null,0,0,0,"","","",null,null,null,null,0]
[null,null,null,null,null,0,0,null,0,0,null,0,0,null,0,0,null,0,0,0,"","","",null,null,null,null,0]
[null,null,null,null,null,0,0,null,0,0,null,0,0,null,0,0,null,0,0,0,"","","",null,null,null,null,0]
[null,null,null,null,null,0,0,null,0,0,null,0,0,null,0,0,null,0,0,0,"","","",null,null,null,null,0]
[null,null,null,null,null,0,0,null,0,0,null,0,0,null,0,0,null,0,0,0,"","","",null,null,null,null,0]
[null,null,null,null,null,0,0,null,0,0,null,0,0,null,0,0,null,0,0,0,"","","",null,null,null,null,0]
[{"$f":"COUNTIF(T7:T21,\">0\")","v":3},"Open","Cheshire",{"$f":"SUMPRODUCT((D7:D21=\"C\")*(T7:T21>0))","v":3}]

{"sheet":"Scoring Tables","index":9,"n_rows":160,"n_cols":37,"rows_kept":160,"cut":false,"hidden":false,"merged":[[0,13,0,14],[104,0,104,5],[104,7,104,12],[0,1,0,4],[0,5,0,7],[0,8,0,12]]}
[null,"SPRINTS",null,null,null,"DISTANCE",null,null,"HURDLES",null,null,null,null,"STEEPLE CHASE",null,null,null,null,null,null,null,null,null,null,null,null,null,null,null,null,null,null,null,"ESAA U15G 75m Hurdles",null,"ESAA U17G 80m Hurdles"]
["Points","100m","200m","300m","400m","800m","1500m","3000m","55m","70m\n75m\n80m","100m\n110m ","300m","400m","1500m","2000m","Points","Points","High Jump","Long Jump","Triple Jump","Pole Vault","Shot","Discus","Javelin","Hammer","Standing Long Jump","Standing Triple Jump","Vertical Jump","Points",null,null,null,null,"Manual Timing",null,"Manual Timing"]
["Amt. Per Extra Pt.",0.1,null,null,null,null,null,null,null,null,null,null,null,null,null,"Amt. Per Extra Pt.","Amt. Per Extra Pt.",null,null,null,null,null,null,null,null,null,null,null,"Amt. Per Extra Pt.",null,null,null,null,8.3000000000000007,"OFFSCALE",9,"OFFSCALE"]
[100,11.3,null,null,null,"00:02:00",null,null,null,null,null,null,null,null,null,100,1,0.65,1.9,null,null,null,null,null,null,null,null,null,1,null,null,null,null,8.4,"ERR",9.1,"ERR"]
[99,11.4,null,null,null,"00:02:02",null,null,null,null,null,null,null,null,null,99,2,0.66,1.93,null,null,null,null,null,null,null,null,null,2,null,null,null,null,8.5,"ERR",9.1999999999999993,"ERR"]
[98,11.5,null,null,null,"00:02:04",null,null,null,null,null,null,null,null,null,98,3,0.67,1.97,null,null,null,null,null,null,null,null,null,3,null,null,null,null,8.6,"ERR",9.3000000000000007,"ERR"]
[97,11.6,null,null,null,"00:02:06",null,null,null,null,null,null,null,null,null,97,4,0.68,2,null,null,null,null,null,null,null,null,null,4,null,null,null,null,8.6999999999999993,"ERR",9.4,"ERR"]
[96,11.7,null,null,null,"00:02:08",null,null,null,11.2,null,null,null,null,null,96,5,0.69,2.0299999999999998,null,null,null,null,null,null,null,null,null,5,null,null,null,null,8.9,"ERR",9.5,"ERR"]
[95,11.8,null,null,null,"00:02:10",null,null,null,11.3,null,null,null,null,null,95,6,0.7,2.0499999999999998,null,null,null,null,null,null,null,null,null,6,null,null,null,null,9,"ERR",9.6,"ERR"]
[94,11.9,null,null,null,"00:02:11",null,null,null,11.4,null,null,null,null,null,94,7,0.71,2.0699999999999998,null,null,null,null,null,null,null,null,null,7,null,null,null,null,9.1,1103,9.6999999999999993,1182]
[93,12,null,null,null,"00:02:12",null,null,null,11.5,null,null,null,null,null,93,8,0.72,2.1,null,null,null,null,null,null,null,null,null,8,null,null,null,null,9.1999999999999993,1084,9.8000000000000007,1162]
[92,12.1,null,null,null,"00:02:13",null,null,null,11.6,null,null,null,null,null,92,9,0.73,2.13,null,null,null,null,null,null,null,null,null,9,null,null,null,null,9.3000000000000007,1066,9.9,1142]
[91,12.2,null,null,null,"00:02:14",null,null,null,11.7,null,null,null,null,null,91,10,0.74,2.16,null,null,null,null,null,null,null,null,null,10,null,null,null,null,9.4,1048,10,1122]
[90,12.3,null,null,null,"00:02:15",null,null,null,11.8,null,null,null,null,null,90,11,0.75,2.19,null,null,2,null,4,null,null,null,null,11,null,null,null,null,9.5,1030,10.1,1103]
[89,12.4,null,null,null,"00:02:16",null,null,null,11.9,null,null,null,null,null,89,12,0.76,2.2200000000000002,null,null,2.1,null,4.5,null,null,null,null,12,null,null,null,null,9.6,1012,10.199999999999999,1084]
[88,12.5,null,null,null,"00:02:17",null,null,null,12,null,null,null,null,null,88,13,0.77,2.25,null,null,2.2000000000000002,null,5,null,null,null,null,13,null,null,null,null,9.6999999999999993,995,10.3,1066]
[87,12.6,null,null,null,"00:02:18",null,null,null,12.1,null,null,null,null,null,87,14,0.78,2.2799999999999998,null,null,2.2999999999999998,null,5.5,null,null,null,null,14,null,null,null,null,9.8000000000000007,978,10.4,1048]
[86,12.7,null,null,null,"00:02:19",null,null,null,12.2,null,null,null,null,null,86,15,0.79,2.31,null,null,2.4,null,6,null,null,null,null,15,null,null,null,null,9.9,962,10.5,1030]
[85,12.8,null,null,null,"00:02:20",null,null,null,12.3,null,null,null,null,null,85,16,0.8,2.34,null,null,2.5,null,6.5,null,null,null,null,16,null,null,null,null,10,946,10.6,1012]
[84,12.9,null,null,null,"00:02:21",null,null,null,12.4,null,null,null,null,null,84,17,0.81,2.37,null,null,2.6,null,7,null,null,null,null,17,null,null,null,null,10.1,930,10.7,995]
[83,13,null,null,null,"00:02:22",null,null,null,12.5,null,null,null,null,null,83,18,0.82,2.4,null,null,2.7,null,7.5,null,null,null,null,18,null,null,null,null,10.199999999999999,914,10.8,978]
[82,13.1,null,null,null,"00:02:23",null,null,null,12.6,null,null,null,null,null,82,19,0.83,2.4300000000000002,null,null,2.8,null,8,null,null,null,null,19,null,null,null,null,10.3,899,10.9,962]
[81,13.2,null,null,null,"00:02:24",null,null,null,12.7,null,null,null,null,null,81,20,0.84,2.46,null,null,2.9,null,8.5,null,null,null,null,20,null,null,null,null,10.4,884,11,946]
[80,13.3,null,null,null,"00:02:25",null,null,null,12.8,null,null,null,null,null,80,21,0.85,2.4900000000000002,null,null,3,null,9,null,null,null,null,21,null,null,null,null,10.5,869,11.1,930]
[79,13.4,null,null,null,"00:02:26",null,null,null,12.9,null,null,null,null,null,79,22,0.86,2.52,null,null,3.1,null,9.25,null,null,null,null,22,null,null,null,null,10.6,855,11.2,914]
[78,13.5,null,null,null,"00:02:27",null,null,null,13,null,null,null,null,null,78,23,0.87,2.5499999999999998,null,null,3.2,null,9.5,null,null,null,null,23,null,null,null,null,10.7,840,11.3,899]
[77,13.6,null,null,null,"00:02:28",null,null,null,13.1,null,null,null,null,null,77,24,0.88,2.58,null,null,3.3,null,9.75,null,null,null,null,24,null,null,null,null,10.8,826,11.4,884]
[76,13.7,null,null,null,"00:02:29",null,null,null,13.2,null,null,null,null,null,76,25,0.89,2.61,null,null,3.4,null,10,null,null,null,null,25,null,null,null,null,10.9,813,11.5,869]
[75,13.8,null,null,null,"00:02:30",null,null,null,13.3,null,null,null,null,null,75,26,0.9,2.64,null,null,3.5,null,10.25,null,null,null,null,26,null,null,null,null,11,799,11.6,855]
[74,13.9,null,null,null,"00:02:32",null,null,null,13.4,null,null,null,null,null,74,27,0.91,2.67,null,null,3.6,null,10.5,null,null,null,null,27,null,null,null,null,11.1,786,11.7,840]
[73,14,null,null,null,"00:02:34",null,null,null,13.5,null,null,null,null,null,73,28,0.92,2.7,null,null,3.7,null,10.75,null,null,null,null,28,null,null,null,null,11.2,773,11.8,826]
[72,null,null,null,null,"00:02:36",null,null,null,13.6,null,null,null,null,null,72,29,0.93,2.73,null,null,3.8,null,11,null,null,null,null,29,null,null,null,null,11.3,760,11.9,813]
[71,14.1,null,null,null,"00:02:38",null,null,null,13.7,null,null,null,null,null,71,30,0.94,2.76,null,null,3.9,null,11.25,null,null,null,null,30,null,null,null,null,11.4,747,12,799]
[70,null,null,null,null,"00:02:40",null,null,null,13.8,null,null,null,null,null,70,31,0.95,2.79,null,null,4,null,11.5,null,null,null,null,31,null,null,null,null,11.5,734,12.1,786]
[69,14.2,null,null,null,"00:02:42",null,null,null,13.9,null,null,null,null,null,69,32,0.96,2.82,null,null,4.0999999999999996,null,11.75,null,null,null,null,32,null,null,null,null,11.6,722,12.2,773]
[68,null,null,null,null,"00:02:44",null,null,null,14,null,null,null,null,null,68,33,0.97,2.85,null,null,4.2,null,12,null,null,null,null,33,null,null,null,null,11.7,710,12.3,760]
[67,14.3,null,null,null,"00:02:46",null,null,null,14.1,null,null,null,null,null,67,34,0.98,2.88,null,null,4.3,null,12.25,null,null,null,null,34,null,null,null,null,11.8,698,12.4,747]
[66,null,null,null,null,"00:02:48",null,null,null,14.2,null,null,null,null,null,66,35,0.99,2.91,null,null,4.4000000000000004,null,12.5,null,null,null,null,35,null,null,null,null,11.9,686,12.5,734]
[65,14.4,null,null,null,"00:02:50",null,null,null,14.3,null,null,null,null,null,65,36,1,2.94,null,null,4.5,null,12.75,null,null,null,null,36,null,null,null,null,12,675,12.6,722]
[64,null,null,null,null,"00:02:52",null,null,null,14.4,null,null,null,null,null,64,37,1.01,2.97,null,null,4.5999999999999996,null,13,null,null,null,null,37,null,null,null,null,12.1,663,12.7,710]
[63,14.5,null,null,null,"00:02:54",null,null,null,14.5,null,null,null,null,null,63,38,1.02,3,null,null,4.7,null,13.25,null,null,null,null,38,null,null,null,null,12.2,652,12.8,698]
[62,null,null,null,null,"00:02:56",null,null,null,14.6,null,null,null,null,null,62,39,1.03,3.03,null,null,4.8,null,13.5,null,null,null,null,39,null,null,null,null,12.3,641,12.9,686]
[61,14.6,null,null,null,"00:02:58",null,null,null,14.7,null,null,null,null,null,61,40,1.04,3.06,null,null,4.9000000000000004,null,13.75,null,null,null,null,40,null,null,null,null,12.4,630,13,675]
[60,null,null,null,null,"00:03:00",null,null,null,14.8,null,null,null,null,null,60,41,1.05,3.09,null,null,5,null,14,null,null,null,null,41,null,null,null,null,12.5,620,13.1,663]
[59,14.7,null,null,null,"00:03:02",null,null,null,14.9,null,null,null,null,null,59,42,1.06,3.12,null,null,5.0999999999999996,null,14.25,null,null,null,null,42,null,null,null,null,12.6,609,13.2,652]
[58,null,null,null,null,"00:03:04",null,null,null,15,null,null,null,null,null,58,43,1.07,3.15,null,null,5.2,null,14.5,null,null,null,null,43,null,null,null,null,12.7,599,13.3,641]
[57,14.8,null,null,null,"00:03:06",null,null,null,15.1,null,null,null,null,null,57,44,1.08,3.18,null,null,5.3,null,14.75,null,null,null,null,44,null,null,null,null,12.8,588,13.4,630]
[56,null,null,null,null,"00:03:08",null,null,null,15.2,null,null,null,null,null,56,45,1.0900000000000001,3.21,null,null,5.4,null,15,null,null,null,null,45,null,null,null,null,12.9,578,13.5,620]
[55,14.9,null,null,null,"00:03:10",null,null,null,15.3,null,null,null,null,null,55,46,1.1000000000000001,3.24,null,null,5.5,null,15.25,null,null,null,null,46,null,null,null,null,13,568,13.6,609]
[54,null,null,null,null,"00:03:12",null,null,null,15.4,null,null,null,null,null,54,47,1.1100000000000001,3.27,null,null,5.6,null,15.5,null,null,null,null,47,null,null,null,null,13.1,558,13.7,599]
[53,15,null,null,null,"00:03:14",null,null,null,15.5,null,null,null,null,null,53,48,1.1200000000000001,3.3,null,null,5.7,null,15.75,null,null,null,null,48,null,null,null,null,13.2,549,13.8,588]
[52,null,null,null,null,"00:03:16",null,null,null,15.6,null,null,null,null,null,52,49,1.1299999999999999,3.33,null,null,5.8,null,16,null,null,null,null,49,null,null,null,null,13.3,539,13.9,578]
[51,15.1,null,null,null,"00:03:18",null,null,null,15.7,null,null,null,null,null,51,50,1.1399999999999999,3.3599999999999901,null,null,5.9,null,16.25,null,null,null,null,50,null,null,null,null,13.4,530,14,568]
[50,null,null,null,null,"00:03:20",null,null,null,15.8,null,null,null,null,null,50,51,1.1499999999999999,3.39,null,null,6,null,16.5,null,null,null,null,51,null,null,null,null,13.5,521,14.1,558]
[49,15.2,null,null,null,"00:03:22",null,null,null,15.9,null,null,null,null,null,49,52,1.1599999999999999,3.42,null,null,6.1,null,16.75,null,null,null,null,52,null,null,null,null,13.6,511,14.2,549]
[48,15.3,null,null,null,"00:03:24",null,null,null,16,null,null,null,null,null,48,53,1.17,3.44999999999999,null,null,6.2,null,17,null,null,null,null,53,null,null,null,null,13.7,502,14.3,539]
[47,15.4,null,null,null,"00:03:26",null,null,null,16.100000000000001,null,null,null,null,null,47,54,1.18,3.48,null,null,6.3,null,17.25,null,null,null,null,54,null,null,null,null,13.8,497,14.4,530]
[46,15.5,null,null,null,"00:03:28",null,null,null,16.2,null,null,null,null,null,46,55,1.19,3.50999999999999,null,null,6.4,null,17.5,null,null,null,null,55,null,null,null,null,13.9,489,14.5,521]
[45,15.6,null,null,null,"00:03:30",null,null,null,16.3,null,null,null,null,null,45,56,1.2,3.5399999999999898,null,null,6.5,null,17.75,null,null,null,null,56,null,null,null,null,14,480,14.6,511]
[44,15.7,null,null,null,"00:03:32",null,null,null,16.399999999999999,null,null,null,null,null,44,57,1.21,3.5699999999999901,null,null,6.6,null,18,null,null,null,null,57,null,null,null,null,14.1,471,14.7,502]
[43,15.8,null,null,null,"00:03:34",null,null,null,16.5,null,null,null,null,null,43,58,1.22,3.5999999999999899,null,null,6.7,null,18.25,null,null,null,null,58,null,null,null,null,14.2,463,14.8,497]
[42,15.9,null,null,null,"00:03:36",null,null,null,16.600000000000001,null,null,null,null,null,42,59,1.23,3.6299999999999901,null,null,6.8,null,18.5,null,null,null,null,59,null,null,null,null,14.3,454,14.9,489]
[41,16,null,null,null,"00:03:38",null,null,null,16.7,null,null,null,null,null,41,60,1.24,3.6599999999999899,null,null,6.9,null,18.75,null,null,null,null,60,null,null,null,null,14.4,446,15,480]
[40,16.100000000000001,null,null,null,"00:03:40",null,null,null,16.8,null,null,null,null,null,40,61,1.25,3.6899999999999902,null,null,7,null,19,null,null,null,null,61,null,null,null,null,14.5,438,15.1,471]
[39,16.2,null,null,null,"00:03:42",null,null,null,16.899999999999999,null,null,null,null,null,39,62,1.26,3.71999999999999,null,null,7.1,null,19.25,null,null,null,null,62,null,null,null,null,14.6,430,15.2,463]
[38,16.3,null,null,null,"00:03:44",null,null,null,17,null,null,null,null,null,38,63,1.27,3.7499999999999898,null,null,7.2,null,19.5,null,null,null,null,63,null,null,null,null,14.7,422,15.3,454]
[37,16.399999999999999,null,null,null,"00:03:46",null,null,null,17.100000000000001,null,null,null,null,null,37,64,1.28,3.77999999999999,null,null,7.3,null,19.75,null,null,null,null,64,null,null,null,null,14.8,414,15.4,446]
[36,16.5,null,null,null,"00:03:48",null,null,null,17.2,null,null,null,null,null,36,65,1.29,3.8099999999999898,null,null,7.4,null,20,null,null,null,null,65,null,null,null,null,14.9,406,15.5,438]
[35,16.600000000000001,null,null,null,"00:03:50",null,null,null,17.3,null,null,null,null,null,35,66,1.3,3.8399999999999901,null,null,7.5000000000000098,null,20.25,null,null,null,null,66,null,null,null,null,15,399,15.6,430]
[34,16.7,null,null,null,"00:03:52",null,null,null,17.399999999999999,null,null,null,null,null,34,67,1.31,3.8699999999999899,null,null,7.6,null,20.5,null,null,null,null,67,null,null,null,null,15.1,391,15.7,422]
[33,16.8,null,null,null,"00:03:54",null,null,null,17.5,null,null,null,null,null,33,68,1.32,3.8999999999999901,null,null,7.7,null,20.75,null,null,null,null,68,null,null,null,null,15.2,384,15.8,414]
[32,16.899999999999999,null,null,null,"00:03:56",null,null,null,17.600000000000001,null,null,null,null,null,32,69,1.33,3.9299999999999899,null,null,7.8000000000000096,null,21,null,null,null,null,69,null,null,null,null,15.3,376,15.9,406]
[31,17,null,null,null,"00:03:58",null,null,null,17.7,null,null,null,null,null,31,70,1.34,3.97,null,null,7.9000000000000101,null,22,null,null,null,null,70,null,null,null,null,15.4,369,16,399]
[30,17.100000000000001,null,null,null,"00:04:00",null,null,null,17.8,null,null,null,null,null,30,71,1.35,4,null,null,8.0000000000000107,null,23,null,null,null,null,71,null,null,null,null,15.5,362,16.100000000000001,391]
[29,17.2,null,null,null,"00:04:02",null,null,null,17.899999999999999,null,null,null,null,null,29,72,1.36,4.0999999999999996,null,null,8.1999999999999993,null,24,null,null,null,null,72,null,null,null,null,15.6,355,16.2,384]
[28,17.3,null,null,null,"00:04:04",null,null,null,18,null,null,null,null,null,28,73,1.37,4.2,null,null,8.3999999999999897,null,25,null,null,null,null,73,null,null,null,null,15.7,348,16.3,376]
[27,17.399999999999999,null,null,null,"00:04:06",null,null,null,18.100000000000001,null,null,null,null,null,27,74,1.38,4.3,null,null,8.5999999999999801,null,26,null,null,null,null,74,null,null,null,null,15.8,341,16.399999999999999,369]
[26,17.5,null,null,null,"00:04:08",null,null,null,18.2,null,null,null,null,null,26,75,1.39,4.4000000000000004,null,null,8.7999999999999705,null,27,null,null,null,null,75,null,null,null,null,15.9,334,16.5,362]
[25,17.600000000000001,null,null,null,"00:04:10",null,null,null,18.3,null,null,null,null,null,25,76,1.4,4.5,null,null,8.9999999999999503,null,28,null,null,null,null,76,null,null,null,null,16,327,16.600000000000001,355]
[24,17.7,null,null,null,"00:04:12",null,null,null,18.399999999999999,null,null,null,null,null,24,77,1.42,4.5999999999999996,null,null,9.1999999999999407,null,29,null,null,null,null,77,null,null,null,null,16.100000000000001,320,16.7,348]
[23,17.8,null,null,null,"00:04:14",null,null,null,18.5,null,null,null,null,null,23,78,1.44,4.7,null,null,9.3999999999999293,null,30,null,null,null,null,78,null,null,null,null,16.2,314,16.8,341]
[22,17.899999999999999,null,null,null,"00:04:16",null,null,null,18.600000000000001,null,null,null,null,null,22,79,1.46,4.8,null,null,9.5999999999999197,null,31,null,null,null,null,79,null,null,null,null,16.3,307,16.899999999999999,334]
[21,18,null,null,null,"00:04:18",null,null,null,18.7,null,null,null,null,null,21,80,1.48,4.9000000000000004,null,null,9.7999999999999101,null,32,null,null,null,null,80,null,null,null,null,16.399999999999999,301,17,327]
[20,18.100000000000001,null,null,null,"00:04:20",null,null,null,18.8,null,null,null,null,null,20,81,1.5,5,null,null,9.9999999999999005,null,33,null,null,null,null,81,null,null,null,null,16.5,294,17.100000000000001,320]
[19,18.2,null,null,null,"00:04:22",null,null,null,18.899999999999999,null,null,null,null,null,19,82,1.52,5.05,null,null,10.1999999999999,null,34,null,null,null,null,82,null,null,null,null,16.600000000000001,288,17.2,314]
[18,18.3,null,null,null,"00:04:24",null,null,null,19,null,null,null,null,null,18,83,1.54,5.0999999999999996,null,null,10.399999999999901,null,35,null,null,null,null,83,null,null,null,null,16.7,282,17.3,307]
[17,18.399999999999999,null,null,null,"00:04:26",null,null,null,19.100000000000001,null,null,null,null,null,17,84,1.56,5.15,null,null,10.5999999999999,null,36,null,null,null,null,84,null,null,null,null,16.8,275,17.399999999999999,301]
[16,18.5,null,null,null,"00:04:28",null,null,null,19.2,null,null,null,null,null,16,85,1.58,5.2,null,null,10.799999999999899,null,37,null,null,null,null,85,null,null,null,null,16.899999999999999,269,17.5,294]
[15,18.600000000000101,null,null,null,"00:04:30",null,null,null,19.3,null,null,null,null,null,15,86,1.6,5.25,null,null,10.999999999999799,null,38,null,null,null,null,86,null,null,null,null,17,263,17.600000000000001,288]
[14,18.7,null,null,null,"00:04:32",null,null,null,19.399999999999999,null,null,null,null,null,14,87,1.62,5.3,null,null,11.1999999999998,null,39,null,null,null,null,87,null,null,null,null,17.100000000000001,257,17.7,282]
[13,18.8000000000001,null,null,null,"00:04:34",null,null,null,19.5,null,null,null,null,null,13,88,1.64,5.35,null,null,11.3999999999998,null,40,null,null,null,null,88,null,null,null,null,17.2,251,17.8,275]
[12,18.899999999999999,null,null,null,"00:04:36",null,null,null,19.600000000000001,null,null,null,null,null,12,89,1.66,5.4,null,null,11.599999999999801,null,41,null,null,null,null,89,null,null,null,null,17.3,246,17.899999999999999,269]
[11,19,null,null,null,"00:04:38",null,null,null,19.7,null,null,null,null,null,11,90,1.68,5.5,null,null,11.7999999999998,null,42,null,null,null,null,90,null,null,null,null,17.399999999999999,240,18,263]
[10,19.2,null,null,null,"00:04:40",null,null,null,19.8,null,null,null,null,null,10,91,1.7,5.6,null,null,11.999999999999799,null,43,null,null,null,null,91,null,null,null,null,17.5,234,18.100000000000001,257]
[9,19.399999999999999,null,null,null,"00:04:42",null,null,null,19.899999999999999,null,null,null,null,null,9,92,1.72,5.7,null,null,12.1999999999998,null,44,null,null,null,null,92,null,null,null,null,17.600000000000001,228,18.2,251]
[8,19.600000000000001,null,null,null,"00:04:44",null,null,null,20,null,null,null,null,null,8,93,1.74,5.8,null,null,12.3999999999998,null,45,null,null,null,null,93,null,null,null,null,17.7,223,18.3,246]
[7,19.8,null,null,null,"00:04:46",null,null,null,20.100000000000001,null,null,null,null,null,7,94,1.76,5.9,null,null,12.599999999999801,null,46,null,null,null,null,94,null,null,null,null,17.8,217,18.399999999999999,240]
[6,20,null,null,null,"00:04:48",null,null,null,20.2,null,null,null,null,null,6,95,1.78,6,null,null,12.799999999999701,null,47,null,null,null,null,95,null,null,null,null,17.899999999999999,212,18.5,234]
[5,20.2,null,null,null,"00:04:50",null,null,null,20.3,null,null,null,null,null,5,96,1.8,6.1,null,null,12.9999999999997,null,48,null,null,null,null,96,null,null,null,null,18,206,18.600000000000001,228]
[4,20.399999999999999,null,null,null,"00:04:52",null,null,null,20.399999999999999,null,null,null,null,null,4,97,1.82,6.2,null,null,13.199999999999701,null,49,null,null,null,null,97,null,null,null,null,18.100000000000001,201,18.7,223]
[3,20.6,null,null,null,"00:04:54",null,null,null,20.5,null,null,null,null,null,3,98,1.84,6.3,null,null,13.3999999999997,null,50,null,null,null,null,98,null,null,null,null,18.2,196,18.8,217]
[2,20.8,null,null,null,"00:04:56",null,null,null,20.6,null,null,null,null,null,2,99,1.86,6.4,null,null,13.599999999999699,null,51,null,null,null,null,99,null,null,null,null,18.3,190,18.899999999999999,212]
[1,21,null,null,null,"00:04:58",null,null,null,20.7,null,null,null,null,null,1,100,1.88,6.5,null,null,13.799999999999701,null,52,null,null,null,null,100,null,null,null,null,18.399999999999999,185,19,206]
[null,null,null,null,null,null,null,null,null,null,null,null,null,null,null,null,null,null,null,null,null,null,null,null,null,null,null,null,null,null,null,null,null,18.5,180,19.100000000000001,201]
["Boys Three Events",null,null,null,null,null,null,"Girls Three Events",null,null,null,null,null,null,null,null,null,null,null,null,null,null,null,null,null,null,null,null,null,null,null,null,null,18.600000000000001,175,19.2,196]
[null,"1*","2*","3*","4*","5*",null,null,"1*","2*","3*","4*","5*",null,null,null,null,null,null,null,null,null,null,null,null,null,null,null,null,null,null,null,null,18.7,170,19.3,190]
["Sen",75,125,175,210,240,null,"Sen",50,90,135,170,210,null,null,null,null,null,null,null,null,null,null,null,null,null,null,null,null,null,null,null,null,18.8,165,19.399999999999999,185]
["U15",75,115,160,195,225,null,"U15",50,85,120,155,195,null,null,null,null,null,null,null,null,null,null,null,null,null,null,null,null,null,null,null,null,18.899999999999999,160,19.5,180]
["U14",60,100,135,170,210,null,"U14",50,80,110,140,180,null,null,null,null,null,null,null,null,null,null,null,null,null,null,null,null,null,null,null,null,19,155,19.600000000000001,175]
["U13",50,85,120,155,195,null,"U13",45,75,95,125,165,null,null,null,null,null,null,null,null,null,null,null,null,null,null,null,null,null,null,null,null,19.100000000000001,150,19.7,170]
["U12",40,70,105,135,165,null,"U12",35,60,80,110,150,null,null,null,null,null,null,null,null,null,null,null,null,null,null,null,null,null,null,null,null,19.2,146,19.8,165]
["U11",25,55,90,120,150,null,"U11",25,45,65,95,135,null,null,null,null,null,null,null,null,null,null,null,null,null,null,null,null,null,null,null,null,19.3,141,19.899999999999999,160]
["U10",15,40,75,105,135,null,"U10",15,30,50,80,120,null,null,null,null,null,null,null,null,null,null,null,null,null,null,null,null,null,null,null,null,19.399999999999999,136,20,155]
[null,"1*","2*","3*","4*","5*",null,null,"1*","2*","3*","4*","5*",null,null,null,null,null,null,null,null,null,null,null,null,null,null,null,null,null,null,null,null,19.5,131,20.100000000000001,150]
[null,null,null,null,null,null,null,null,null,null,null,null,null,null,null,null,null,null,null,null,null,null,null,null,null,null,null,null,null,null,null,null,null,19.600000000000001,127,20.2,146]
[null,null,null,null,null,null,null,null,null,null,null,null,null,null,null,null,null,null,null,null,null,null,null,null,null,null,null,null,null,null,null,null,null,19.7,122,20.3,141]
[null,null,null,null,null,null,null,null,null,null,null,null,null,null,null,null,null,null,null,null,null,null,null,null,null,null,null,null,null,null,null,null,null,19.8,118,20.399999999999999,136]
[null,120,190,265,335,385,null,null,null,null,null,null,null,null,null,null,null,null,null,null,null,null,null,null,null,null,null,null,null,null,null,null,null,19.899999999999999,113,20.5,131]
[null,110,null,null,null,null,null,null,null,null,null,null,null,null,null,null,null,null,null,null,null,null,null,null,null,null,null,null,null,null,null,null,null,20,109,20.6,127]
[null,null,null,null,null,null,null,null,null,null,null,null,null,null,null,null,null,null,null,null,null,null,null,null,null,null,null,null,null,null,null,null,null,20.100000000000001,104,20.7,122]
[null,null,null,null,null,null,null,null,null,null,null,null,null,null,null,null,null,null,null,null,null,null,null,null,null,null,null,null,null,null,null,null,null,20.2,100,20.8,118]
[null,null,null,null,null,null,null,null,null,null,null,null,null,null,null,null,null,null,null,null,null,null,null,null,null,null,null,null,null,null,null,null,null,20.3,96,20.9,113]
["IAAF Scoring Tables for Combined Events",null,null,null,null,null,null,"Parameters used are:",null,"A","B*","C",null,null,null,null,null,null,null,null,null,null,null,null,null,null,null,null,null,null,null,null,null,20.399999999999999,92,21,109]
[null,null,null,null,null,null,null,null,null,null,null,null,null,null,null,null,null,null,null,null,null,null,null,null,null,null,null,null,null,null,null,null,null,20.5,87,21.1,104]
[null,"MEN'S","EVENTS","a","b","c",null,"MALE EVENTS",null,null,null,null,null,null,null,null,null,null,null,null,null,null,null,null,null,null,null,null,null,null,null,null,null,20.6,83,21.2,100]
[null,"100m","(auto)",25.434699999999999,18,1.81,null,"100 Meter",null,25.434699999999999,18,1.81,null,null,null,null,null,null,null,null,null,null,null,null,null,null,null,null,null,null,null,null,null,20.7,79,21.3,96]
[null,"110mH","(auto)",5.7435200000000002,28.5,1.92,null,"100 Meter Intermediate Boys hurdles",null,7.2370000000000001,27,1.835,"U15",null,null,null,null,null,null,null,null,null,null,null,null,null,null,null,null,null,null,null,null,20.8,75,21.4,92]
[null,"1500m",null,3.7679999999999998E-2,480,1.85,null,"110 Meter Hurdles",null,5.7435200000000002,28.5,1.92,null,null,null,null,null,null,null,null,null,null,null,null,null,null,null,null,null,null,null,null,null,20.9,71,21.5,87]
[null,"200m","(auto)",5.8425000000000002,38,1.81,null,"1500 Meter",null,3.7679999999999998E-2,480,1.85,null,null,null,null,null,null,null,null,null,null,null,null,null,null,null,null,null,null,null,null,null,21,67,21.6,83]
[null,"400m","(auto)",1.53775,82,1.81,null,"200 Meter",null,5.8425000000000002,38,1.81,null,null,null,null,null,null,null,null,null,null,null,null,null,null,null,null,null,null,null,null,null,21.1,63,21.7,79]
[null,"Discus",null,12.91,4,1.1000000000000001,null,"400 Meter",null,1.53775,82,1.81,null,null,null,null,null,null,null,null,null,null,null,null,null,null,null,null,null,null,null,null,null,21.2,59,21.8,75]
[null,"High Jump",null,0.84650000000000003,75,1.42,null,"80 Meter Junior Boys Hurdles",null,7.399,24,1.835,"U13",null,null,null,null,null,null,null,null,null,null,null,null,null,null,null,null,null,null,null,null,21.3,55,21.9,71]
[null,"Javelin",null,10.14,7,1.08,null,"800m Intermediate Boys",null,0.23200000000000001,200,1.85,"U15",null,null,null,null,null,null,null,null,null,null,null,null,null,null,null,null,null,null,null,null,21.4,51,22,67]
[null,"Long Jump",null,0.14354,220,1.4,null,"Discus",null,12.91,4,1.1000000000000001,null,null,null,null,null,null,null,null,null,null,null,null,null,null,null,null,null,null,null,null,null,21.5,47,22.1,63]
[null,"Pole Vault",null,0.2797,100,1.35,null,"High Jump",null,0.84650000000000003,75,1.42,null,null,null,null,null,null,null,null,null,null,null,null,null,null,null,null,null,null,null,null,null,21.6,43,22.2,59]
[null,"Shot",null,51.39,1.5,1.05,null,"Javelin",null,10.14,7,1.08,null,null,null,null,null,null,null,null,null,null,null,null,null,null,null,null,null,null,null,null,null,21.7,39,22.3,55]
["(Indoors)","60m","(auto)",58.015000000000001,11.5,1.81,null,"Long Jump",null,0.14354,220,1.4,null,null,null,null,null,null,null,null,null,null,null,null,null,null,null,null,null,null,null,null,null,21.8,36,22.4,51]
["(Indoors)","1000m",null,8.7129999999999999E-2,305.5,1.85,null,"Pole Vault",null,0.2797,100,1.35,null,null,null,null,null,null,null,null,null,null,null,null,null,null,null,null,null,null,null,null,null,21.9,32,22.5,47]
["(Indoors)","60mH","(auto)",20.517299999999999,15.5,1.92,null,"Shot",null,51.39,1.5,1.05,null,null,null,null,null,null,null,null,null,null,null,null,null,null,null,null,null,null,null,null,null,22,28,22.6,43]
[null,null,null,null,null,null,null,null,null,null,null,null,null,null,null,null,null,null,null,null,null,null,null,null,null,null,null,null,null,null,null,null,null,22.1,25,22.7,39]
[null,"WOMEN'S","EVENTS","a","b","c",null,"FEMALE EVENTS",null,null,null,null,null,null,null,null,null,null,null,null,null,null,null,null,null,null,null,null,null,null,null,null,null,22.2,21,22.8,36]
[null,"200m","(auto)",4.9908700000000001,42.5,1.81,null,"200 Meter",null,4.9908700000000001,42.5,1.81,null,null,null,null,null,null,null,null,null,null,null,null,null,null,null,null,null,null,null,null,null,22.3,17,22.9,32]
[null,"800m","(auto)",0.11193,254,1.88,null,"800 Meter",null,0.11193,254,1.88,null,null,null,null,null,null,null,null,null,null,null,null,null,null,null,null,null,null,null,null,null,22.4,14,23,28]
[null,"100mH","(auto)",9.2307600000000001,26.7,1.835,null,"100 Meter Hurdles",null,9.2307600000000001,26.7,1.835,null,null,null,null,null,null,null,null,null,null,null,null,null,null,null,null,null,null,null,null,null,22.5,10,23.1,25]
[null,"High Jump",null,1.8452299999999999,75,1.3480000000000001,null,"80 Meter Intermediate Girls hurdles",null,"Look up tables used as there is no formula",null,null,null,null,null,null,null,null,null,null,null,null,null,null,null,null,null,null,null,null,null,null,null,22.6,7,23.2,21]
[null,"Long Jump",null,0.188807,210,1.41,null,"75 Meter Junior Girls Hurdles",null,"Look up tables used as there is no formula",null,null,null,null,null,null,null,null,null,null,null,null,null,null,null,null,null,null,null,null,null,null,null,22.7,3,23.3,17]
[null,"Shot",null,56.021099999999997,1.5,1.05,null,"High jump",null,1.8452299999999999,75,1.3480000000000001,null,null,null,null,null,null,null,null,null,null,null,null,null,null,null,null,null,null,null,null,null,22.8,"ERR",23.4,14]
[null,"Javelin",null,15.9803,3.8,1.04,null,"Long Jump",null,0.188807,210,1.41,null,null,null,null,null,null,null,null,null,null,null,null,null,null,null,null,null,null,null,null,null,22.9,"ERR",23.5,10]
["(Decathlon)","100m","(auto)",17.856999999999999,21,1.81,null,"Shot",null,56.021099999999997,1.5,1.05,null,null,null,null,null,null,null,null,null,null,null,null,null,null,null,null,null,null,null,null,null,23,"ERR",23.6,7]
["(Decathlon)","400m","(auto)",1.3428500000000001,91.7,1.81,null,"Javelin",null,15.9803,3.8,1.04,null,null,null,null,null,null,null,null,null,null,null,null,null,null,null,null,null,null,null,null,null,23.1,"ERR",23.7,3]
["(Decathlon)","1500m",null,2.8830000000000001E-2,535,1.88,null,null,null,null,null,null,null,null,null,null,null,null,null,null,null,null,null,null,null,null,null,null,null,null,null,null,null,23.2,"ERR",23.8,"ERR"]
["(Decathlon)","Pole Vault",null,0.44124999999999998,100,1.35,null,null,null,null,null,null,null,null,null,null,null,null,null,null,null,null,null,null,null,null,null,null,null,null,null,null,null,23.3,"ERR",23.9,"ERR"]
["(Decathlon)","Discus",null,12.331099999999999,3,1.1000000000000001]
["(Indoors)","60mH","(auto)",20.047899999999998,17,1.835]
[]
[null,"Manual Time Measurement"]
[null,"100m",0.24]
[null,"110mH",0.24]
[null,"200m",0.24]
[null,"400m",0.14000000000000001]

{"sheet":"AAA Grades","index":10,"n_rows":51,"n_cols":11,"rows_kept":51,"cut":false,"hidden":false,"merged":[]}
["AAA Standard Grades 2015/2016"]
[]
["U17M","G1","G2","G3","G4",null,"U17W","G1","G2","G3","G4"]
["100m",11.2,11.3,11.5,11.8,null,"100m",12.3,12.6,12.8,13.1]
["200m",22.6,23,23.4,24,null,"200m",25.4,25.7,26.3,27]
["400m",51.2,51.8,52.9,54.3,null,"300m",41.4,42.1,43,44.5]
["800m","00:01:57","00:01:59.500","00:02:02.500","00:02:06.500",null,"400m",58.5,59.8,61,63.2]
["1500m","00:04:06","00:04:11.500","00:04:17.500","00:04:27.500",null,"800m","00:02:15.500","00:02:17.500","00:02:20.500","00:02:26"]
["3000m","00:08:51","00:09:06","00:09:21","00:09:42",null,"1500m","00:04:39.300","00:04:45.400","00:04:53.900","00:05:04.300"]
["100mH",13.7,14,14.6,15.4,null,"3000m","00:10:07","00:10:23","00:10:50","00:11:23.800"]
["400mH",55.9,57.5,59.5,62.5,null,"80mH",11.8,12.1,12.5,13.1]
["High Jump",1.9,1.85,1.76,1.7,null,"300mH",44.9,45.9,47.7,50.2]
["Long Jump",6.3,6.1,5.9,5.6,null,"High Jump",1.65,1.6,1.55,1.5]
["Triple Jump",13,12.5,12.05,11.4,null,"Long Jump",5.35,5.25,5.05,4.8]
["Pole Vault",4.3,4,3.6,3,null,"Triple Jump",10.85,10.55,10.15,9.4499999999999993]
["Javelin",52.95,48.1,44.15,38.799999999999997,null,"Pole Vault",3.5,3.3,3,2.5499999999999998]
["Discus",41,37.75,33.450000000000003,28.25,null,"Javelin",38.200000000000003,34.700000000000003,31.45,27.8]
["Hammer",55.05,50.35,41.85,29.65,null,"Discus",35.799999999999997,31.7,27.75,23.4]
["Shot",13.6,12.75,11.7,10.65,null,"Hammer",50.7,45.6,40.15,28.3]
[null,null,null,null,null,null,"Shot",11.6,10.95,10.15,9.15]
["U15B","G1","G2","G3","G4"]
["100m",11.7,11.9,12.1,12.4,null,"U15G","G1","G2","G3","G4"]
["200m",23.9,24.3,24.8,25.6,null,"100m",12.7,12.9,13.2,13.5]
["400m",53.8,55.2,56.9,59,null,"200m",26.2,26.6,27.3,28]
["800m","00:02:06.500","00:02:10","00:02:13.200","00:02:18.500",null,"300m",42.6,43.5,44.4,45.9]
["1500m","00:04:22","00:04:27.500","00:04:34.500","00:04:46.500",null,"800m","00:02:19.400","00:02:22.300","00:02:25.600","00:02:31.200"]
["3000m","00:09:21.500","00:09:33.500","00:09:47","00:10:09",null,"1500m","00:04:48.700","00:04:53.900","00:05:02","00:05:15.500"]
["80mH",12,12.3,12.7,13.4,null,"3000m","00:10:22","00:10:41.500","00:11:02.500","00:11:36"]
["High Jump",1.7,1.65,1.6,1.53,null,"75mH",11.9,12.3,12.7,13.4]
["Long Jump",5.7,5.5,5.3,5,null,"High Jump",1.57,1.53,1.47,1.4]
["Triple Jump",11.9,11.5,11.05,10.5,null,"Long Jump",5.05,4.9000000000000004,4.7,4.45]
["Pole Vault",3.4,3.1,2.8,2.4,null,"Triple Jump"]
["Javelin",43,40,36.65,32.5,null,"Pole Vault",2.95,2.8,2.5,2.15]
["Discus",35.950000000000003,32.549999999999997,29.7,25.6,null,"Discus",28.3,25.65,23,19.5]
["Hammer",46,39.799999999999997,34.200000000000003,26.7,null,"Hammer",42.6,37.799999999999997,31.1,24.5]
["Shot",12.45,11.7,10.95,10.050000000000001,null,"Shot",10.6,9.85,9.1,8.3000000000000007]
["Pentathlon*",2600,2390,2170,1865,null,"Pentathlon",2770,2600,2360,2075]
[null,null,null,null,null,null,"U13G","G1","G2","G3","G4"]
["U13B","G1","G2","G3","G4",null,"75m",10.5,10.6,10.9,11.3]
["75m",10,10.199999999999999,10.5,11,null,"100m",13.6,13.8,14.1,14.5]
["100m",12.9,13.2,13.5,14,null,"150m",20.5,21,21.5,22.3]
["150m",19.399999999999999,19.600000000000001,20.6,21.5,null,"200m",28.4,28.9,29.6,30.7]
["200m",26.8,27.3,28.1,29.1,null,"800m","00:02:29","00:02:31.800","00:02:35.500","00:02:40.800"]
["800m","00:02:21.500","00:02:25.500","00:02:29","00:02:34.500",null,"1200m","00:03:57.600","00:04:00.800","00:04:05.600","00:04:13.400"]
["1500m","00:04:50.500","00:04:55.500","00:05:07","00:05:15.500",null,"1500m","00:05:08.200","00:05:15.200","00:05:23.600","00:05:37.900"]
["75mH",12.9,13.5,14.2,15.3,null,"70m Hurdles",11.9,12.2,12.6,13.4]
["High Jump",1.45,1.4,1.35,1.3,null,"High Jump",1.41,1.36,1.3,1.25]
["Long Jump",4.7,4.55,4.4000000000000004,4.1500000000000004,null,"Long Jump",4.5,4.3499999999999996,4.2,3.95]
["Javelin",31.75,28.75,25.45,21.25,null,"Javelin",25.6,23.05,19.2,15.4]
["Discus",24.7,22,19.75,16.600000000000001,null,"Discus",23,20.399999999999999,17.8,14.9]
["Shot",9.4499999999999993,8.9,8.1,7.15,null,"Shot",8.4499999999999993,7.8,7.2,6.45]

{"sheet":"Lists","index":11,"n_rows":3,"n_cols":2,"rows_kept":3,"cut":false,"hidden":false,"merged":[]}
["Gender","Cheshire\nOpen"]
["M","C"]
["F"]

{"sheet":"U13G choices","index":12,"n_rows":32,"n_cols":26,"rows_kept":32,"cut":false,"hidden":false,"merged":[[0,0,0,7],[2,25,2,26]]}
["U13 Girls "]
[]
["Arranged by:",null,{"$f":"ArrangedBy","v":"Handforth W A A C"},null,null,null,null,"Scorer:",{"$f":"Scorer","v":"H Branthwaite"},null,null,null,null,null,null,null,null,null,null,null,null,null,null,"Date:",null,{"$f":"Date","v":"2015-09-13"}]
["Sponsored by:",null,{"$f":"Sponsor","v":"Jones Homes"},null,null,null,null,"Checked by:"]
["No.","Name","Club","Cheshire","100m","70m\nHurdles","800m","Long\nJump","High\nJump","Shot","Jav."]
[null,"Atkinson, Amelia","Crewe & Nantwich","C"]
[null,"Grinnell, Ellie","Crewe & Nantwich","C"]
[null,"Heaword, Eve","Crewe & Nantwich","C"]
[null,"Giller, Alice","DASH","C"]
[null,"Giller, Catherine","DASH","C"]
[null,"Angus, Elouise","Halton & Frodsham","C"]
[null,"Hickey, Hollie","Halton & Frodsham","C"]
[null,"Povall-Clarke, Emilia","Halton & Frodsham","C"]
[null,"Wright, Elizabeth","Halton & Frodsham","C"]
[null,"Kirker, Alice","Handforth WAAC"]
[null,"Carroll, Chantelle","Macclesfield H","C"]
[null,"Cobey, Eve","Macclesfield H","C"]
[null,"Folkes, Olivia","Macclesfield H","C"]
[null,"Hatton, Lydia","Macclesfield H","C"]
[null,"Robinson, Lauren","Macclesfield H","C"]
[null,"Jackson, Ellie","Sale H","C"]
[null,"Marshall, Lauren","St. Helens Sutton"]
[null,"Pilkington, Jorden","St. Helens Sutton"]
[null,"Larkin, Molly","Trafford "]
[null,"Kelly, Bethan","Vale Royal","C"]
[null,"Nugent, Millie","Vale Royal","C"]
[null,"Hough, Eleanor","Warrington","C"]
[null,"Clarke, Issy","West Cheshire","C"]
[null,"Finn, Ellie","West Cheshire","C"]
[null,"Howe, Emma","West Cheshire","C"]
[null,"Tipping, Maisie","West Cheshire","C"]
[null,"Rowlands, Emma","Wirral"]

{"sheet":"U13B choices","index":13,"n_rows":22,"n_cols":11,"rows_kept":22,"cut":false,"hidden":false,"merged":[[0,0,0,5]]}
["U13 Boys "]
[]
["Arranged by:",null,{"$f":"ArrangedBy","v":"Handforth W A A C"},null,null,"Scorer:",{"$f":"Scorer","v":"H Branthwaite"},null,null,"Date:",{"$f":"Date","v":"2015-09-13"}]
["Sponsored by:",null,{"$f":"Sponsor","v":"Jones Homes"},null,null,"Checked by:"]
["No.","Name","Club","Cheshire","100m","75m\nHurdles","800m","Long\nJump","High\nJump","Shot","Jav."]
[null,"Robertson, Josh","City of Stoke","C"]
[null,"Williamson, Jack","Crewe & Nantwich","C"]
[null,"Ainley, James","DASH","C"]
[null,"Ainley, Matthew","DASH","C"]
[null,"Firth, Sam","Handforth WAAC"]
[null,"Henshaw, Jamie","Handforth WAAC","C"]
[null,"Stone, Oscar","Handforth WAAC","C"]
[null,"Carey, Joshua","Macclesfield H","C"]
[null,"Goodall, Jac","Macclesfield H","C"]
[null,"Johnson, Oscar","Macclesfield H","C"]
[null,"Willis, Ben","Macclesfield H","C"]
[null,"Boyd, Harry","Sale H","C"]
[null,"Hurst, George","Trafford "]
[null,"Kelly, Jordan","Vale Royal","C"]
[null,"Bowyer, Finnian","West Cheshire","C"]
[null,"Mason, Alexander","West Cheshire","C"]
[null,"Scott, William","West Cheshire","C"]

{"sheet":"Sheet1","index":14,"n_rows":0,"n_cols":0,"rows_kept":0,"cut":false,"hidden":false,"merged":[]}